{"text_format":"1","workbook":"xlsx","n_sheets":7,"sheets":["DESCRIPTION OF STICKER NUMBER","LANGUAGE CORD","STICKER SIZE","STICKER LIST","COMPARISON TABLE","NOTES","MODEL LIST"],"not_rendered":{"charts":0,"images":25,"macros":1,"external_links":0,"defined_names":1,"comments":0,"pivot_tables":0},"unopened":[],"bounds":{"document_bytes":16777216,"sheet_cells":100000,"rows_first":2000,"rows_last":500,"rows_between":2000,"halvings":0,"cell_chars":16384,"cell_head_chars":4096},"cells_cut":0,"cells_raw":0,"read":"whole","date_system":"1900"}

{"sheet":"DESCRIPTION OF STICKER NUMBER","index":0,"n_rows":61,"n_cols":23,"rows_kept":61,"cut":false,"hidden":false,"merged":[[6,8,6,9],[7,8,7,15],[6,10,6,15],[26,11,26,12],[60,8,60,15],[55,7,55,15],[56,8,56,15],[57,8,57,15],[58,8,58,15],[59,8,59,15],[52,7,52,15],[51,7,51,15],[46,8,46,15],[38,8,38,15],[39,8,39,15],[41,7,41,15],[3,7,3,15],[9,7,9,15],[31,7,31,15],[14,8,14,9],[14,11,14,12],[14,14,14,15],[18,8,18,9],[18,11,18,12],[18,14,18,15],[5,10,5,15],[4,10,4,15],[10,8,10,9],[10,11,10,12],[10,14,10,15],[4,8,4,9],[5,8,5,9],[45,8,45,15],[22,8,22,9],[22,11,22,12],[32,8,34,15],[35,8,37,15],[44,8,44,15],[42,8,42,15],[43,8,43,15],[22,14,22,15],[26,8,26,9]]}
["DESCRIPTION OF STICKER NUMBER"]
["[PL STICKER]"]
[]
[null,null,null,null,null,null,null,"(1) SIGNAL WORD",null,null,null,null,null,null,null,null,null,"Example1: ROTATING PARTS"]
[null,null,null,null,null,null,null,"D",null,null,"There are imminent risks of death or serious injuries to the operators.",null,null,null,null,null,null,"Different messages for DANGER and WARNING"]
[null,null,null,null,null,null,null,"W",null,null,"The operators might result in death or serious injuries.",null,null,null,null,null,null,"W-031-EN/0",null,null,null,null,"D-032-EN/0"]
[null,null,null,null,null,null,null,"C",null,null,"The operators might result in slight injuries."]
[null,null,null,null,null,null,null,"Z","Nothing"]
[]
[null,null,null,null,null,null,null,"(2) MESSAGE (TYPES OF RISK)"]
[null,null,null,null,null,null,null,1,"ELECTRIC SHOCK HAZARD",null,2,"HOT SURFACE",null,3,"ROTATING PARTS"]
[]
[null,null,null,null,null,null,null,null,null,null,null,null,null,null,null,null,null,"Example2: PINCH POINT"]
[null,null,null,null,null,null,null,null,null,null,null,null,null,null,null,null,null,"Same messages for DANGER and WARNING"]
[null,null,null,null,null,null,null,4,"MOVING PARTS",null,5,"PINCH POINT",null,6,"ENTANGLEMENT HAZARD",null,null,"W-051-EN/0",null,null,null,null,"C-051-EN/0"]
[]
[]
[]
[null,null,null,null,null,null,null,7,"TOPPLING HAZARD",null,8,"SHARP POINTS",null,9,"FLYING DEBRIS"]
[]
[]
[]
[null,null,null,null,null,null,null,10,"DO NOT OPEN/CLOSE DOOR DURING OPERATION",null,11,"DO NOT USE FLAMMABLE MATERIAL",null,12,"LIFTING POSITION"]
[]
[]
[]
[null,null,null,null,null,null,null,13,"MAGNETIC FIELD ATTENTION",null,14,"NO APPROACH OF PACEMAKER WEARERS"]
[]
[]
[]
[]
[null,null,null,null,null,null,null,"(3) MESSAGE (contents and/or how to avoid the risk)  Example:ROTATING PARTS"]
[null,null,null,null,null,null,null,1,"Can cut fingers or hands.\nKeep fingers and hands away.\nTurn off power before maintenance."]
[]
[]
[null,null,null,null,null,null,null,2,"Can cause serious injuries or death.\nKeep hands and other body parts away.\nTurn off power before maintenance."]
[]
[]
[null,null,null,null,null,null,null,"-"]
[null,null,null,null,null,null,null,9,"Nothing"]
[]
[null,null,null,null,null,null,null,"(4)  LANGUAGE (LANGUAGE CORD ISO639-1)"]
[null,null,null,null,null,null,null,"JA","Japanese"]
[null,null,null,null,null,null,null,"EN","English"]
[null,null,null,null,null,null,null,"ZH","Chinese"]
[null,null,null,null,null,null,null,"ZZ","Nothing"]
[null,null,null,null,null,null,null,null,"Click here to see other language codes."]
[]
[]
["[PROCEDURE STICKER]"]
[]
[null,null,null,null,null,null,null,"(1) SERIAL NUMBER",null,null,null,null,null,null,null,null,null,"Example1: Trun off power and disconnect supply line before maintenance"]
[null,null,null,null,null,null,null,"A01, A02, A03, ……, A99, B01, B02,……",null,null,null,null,null,null,null,null,null,"N-A01-EN/0"]
[null,null,null,null,null,null,null,"(Serial numbers starting with A01)"]
[]
[null,null,null,null,null,null,null,"(2)  LANGUAGE (LANGUAGE CORD ISO639-1)"]
[null,null,null,null,null,null,null,"JA","Japanese"]
[null,null,null,null,null,null,null,"EN","English"]
[null,null,null,null,null,null,null,"ZH","Chinese"]
[null,null,null,null,null,null,null,"ZZ","Nothing"]
[null,null,null,null,null,null,null,null,"Click here to see other language codes."]

{"sheet":"LANGUAGE CORD","index":1,"n_rows":59,"n_cols":2,"rows_kept":59,"cut":false,"hidden":false,"merged":[]}
["LANGUAGE CORD (ISO639-1)"]
[]
["CORD","LANGUAGE"]
["JA","Japanese"]
["EN","English"]
["ZH","Chinese"]
["ZZ","Nothing"]
["AF","Afrikaans"]
["SQ","Albanian"]
["AR","Arabic"]
["BN","Bengali"]
["BS","Bosnian"]
["BG","Bulgarian"]
["MY","Burmese"]
["HR","Croatian"]
["CS","Czech"]
["DA","Danish"]
["NL","Dutch"]
["ET","Estonian"]
["FI","Finnish"]
["FR","French"]
["GD","Gaelic"]
["DE","German"]
["HE","Hebrew"]
["HI","Hindi"]
["HU","Hungarian"]
["IS","Icelandic"]
["ID","Indonesian"]
["IT","Italian"]
["KK","Kazakh"]
["KM","Khmer"]
["KO","Korean"]
["LO","Lao"]
["LV","Latvian"]
["LT","Lithuanian"]
["MK","Macedonian"]
["MS","Malay"]
["MT","Maltese"]
["EL","Modern Greek"]
["MN","Mongolian"]
["NE","Nepali"]
["NO","Norwegian"]
["PS","Pashto"]
["FA","Persian"]
["PL","Polish"]
["PT","Portuguese"]
["RO","Romanian"]
["RU","Russian"]
["SR","Serbian"]
["SK","Slovak"]
["SL","Slovenian"]
["ES","Spanish"]
["SV","Swedish"]
["TL","Tagalog"]
["TH","Thai"]
["TR","Turkish"]
["UK","Ukrainian"]
["UR","Urdu"]
["VI","Vietnamese"]

{"sheet":"STICKER SIZE","index":2,"n_rows":17,"n_cols":1,"rows_kept":17,"cut":false,"hidden":false,"merged":[]}
["STICKER SIZE"]
["[With message]"]
[]
[]
[]
[]
[]
[]
[]
[]
[]
[]
[]
[]
[]
[]
["[Without message]"]

{"sheet":"STICKER LIST","index":3,"n_rows":34,"n_cols":6,"rows_kept":34,"cut":false,"hidden":false,"merged":[[2,2,3,2],[2,3,2,5],[2,1,3,1],[25,0,26,0],[25,1,26,1],[25,3,25,5],[25,2,26,2],[4,0,5,0],[6,0,7,0],[8,0,10,0],[13,0,14,0],[16,0,17,0],[2,0,3,0],[11,0,12,0]]}
["STICKER LIST"]
[]
["PL STICKER","NUMBER","DRAWING NUMBER(MJ)","CORD(MJ)"]
[null,null,null,"Japanese","English","Chinese"]
["ELECTRIC SHOCK HAZARD","W-011-□□","F39190",29746,29765,29766]
[null,"Z-019-ZZ","F39248",29767,"←","←"]
["HOT SURFACE","W-021-□□","F39192",29768,29769,29770]
[null,"Z-029-ZZ","F39249",29771,"←","←"]
["ROTATING PARTS","W-031-□□","F39250",29772,29773,29774]
[null,"D-032-□□","F39251",29775,29776,29777]
[null,"Z-039-ZZ","F39252",29778,"←","←"]
["MOVING PARTS","W-041-□□","F39253",29779,29780,29781]
[null,"Z-049-ZZ","F41737",30383,"←","←"]
["PINCH POINT","W-051-□□","F39254",29782,29783,29784]
[null,"C-051-□□","F39255",29785,29786,29787]
["ENTANGLEMENT HAZARD","W-061-□□","F39256",29788,29789,29790]
["TOPPLING HAZARD","W-071-□□","F39257",29791,29792,29793]
[null,"D-072-□□","F39258",29794,29795,29796]
["SHARP POINTS","Z-089-ZZ","F39259",29797,"←","←"]
["FLYING DEBRIS","W-091-□□","F39260",29798,29799,29800]
["DO NOT OPEN/CLOSE DOOR DURING OPERATION","W-101-□□","F39261",29801,29802,29803]
["DO NOT USE FLAMMABLE MATERIAL","W-111-□□","F39262",29804,29805,29806]
["LIFTING POSITION","Z-129-ZZ","F41738",30384,"←","←"]
["MAGNETIC FIELD ATTENTION","Z-139-ZZ","F41739",30385,"←","←"]
["NO APPROACH OF PACEMAKER WEARERS","Z-149-ZZ","F41740",30386,"←","←"]
["PROCEDURE STICKER","NUMBER","DRAWING NUMBER(MJ)","CORD(MJ)"]
[null,null,null,"Japanese","English","Chinese"]
["Trun off power and disconnect supply line before maintenance","N-A01-□□","F39240",29745,29807,29808]
["If breaker trips, turn breaker OFF, refer to instruction manual to solve problem, then restart operation","N-A02-□□","F39263",29809,29810,29812]
["Always keep water supply/drain pipe and media feed/return pipe open during operation.","N-A03-□□","F39264",29813,29814,29815]
["Turn on breaker inside control panel 12 hours prior to operation","N-A04-□□","F39265",29816,29817,29818]
["Clean filter frequenty","N-A05-□□","F41735",30387,30388,30389]
["Remove dust from dust cox frequently","N-A06-□□","F41736",30390,30391,30392]
[null,"* In place of the square is the language code."]

{"sheet":"COMPARISON TABLE","index":4,"n_rows":546,"n_cols":19,"rows_kept":546,"cut":false,"hidden":false,"merged":[[419,7,419,9],[419,10,419,12],[306,10,306,12],[356,15,356,17],[385,7,385,9],[385,10,385,12],[385,15,385,17],[358,7,358,9],[358,10,358,12],[368,7,368,9],[368,10,368,12],[377,7,377,9],[377,10,377,12],[377,15,377,17],[444,3,445,3],[444,4,445,4],[444,5,445,5],[444,6,445,6],[444,7,445,7],[444,8,445,8],[444,9,445,9],[444,10,445,10],[444,11,445,11],[216,7,216,9],[216,10,216,12],[240,7,240,9],[240,10,240,12],[254,7,254,9],[254,10,254,12],[265,7,265,9],[265,10,265,12],[306,15,306,17],[543,4,543,6],[543,7,543,9],[543,10,543,12],[543,15,543,17],[525,18,527,18],[526,4,526,6],[526,7,526,9],[526,10,526,12],[526,15,526,17],[534,18,536,18],[535,4,535,6],[535,7,535,9],[535,10,535,12],[535,15,535,17],[542,18,544,18],[452,10,452,12],[452,15,452,17],[425,18,427,18],[426,4,426,6],[426,7,426,9],[426,10,426,12],[508,18,510,18],[509,4,509,6],[509,7,509,9],[509,10,509,12],[509,15,509,17],[493,18,495,18],[494,4,494,6],[494,7,494,9],[494,10,494,12],[494,15,494,17],[426,15,426,17],[472,18,474,18],[473,4,473,6],[473,7,473,9],[473,10,473,12],[473,15,473,17],[444,12,445,12],[296,4,296,6],[296,7,296,9],[296,10,296,12],[296,15,296,17],[408,4,408,6],[408,7,408,9],[408,10,408,12],[408,15,408,17],[416,18,418,18],[417,4,417,6],[417,7,417,9],[417,10,417,12],[417,15,417,17],[385,4,385,6],[407,18,409,18],[397,7,397,9],[397,10,397,12],[148,18,150,18],[162,7,162,9],[162,10,162,12],[182,7,182,9],[182,10,182,12],[136,10,136,12],[110,7,110,9],[451,18,453,18],[452,4,452,6],[452,7,452,9],[225,18,227,18],[226,4,226,6],[226,7,226,9],[226,10,226,12],[226,15,226,17],[213,18,215,18],[315,18,317,18],[316,4,316,6],[316,7,316,9],[316,10,316,12],[316,15,316,17],[284,18,286,18],[285,4,285,6],[285,7,285,9],[121,18,123,18],[135,18,137,18],[122,4,122,6],[122,7,122,9],[122,10,122,12],[122,15,122,17],[136,4,136,6],[136,7,136,9],[136,15,136,17],[77,15,77,17],[63,7,63,9],[63,10,63,12],[62,7,62,9],[62,10,62,12],[214,4,214,6],[214,7,214,9],[214,10,214,12],[214,15,214,17],[108,4,108,6],[108,7,108,9],[108,10,108,12],[108,15,108,17],[10,18,12,18],[33,18,35,18],[11,4,11,6],[11,7,11,9],[11,10,11,12],[11,15,11,17],[34,4,34,6],[34,7,34,9],[34,10,34,12],[34,15,34,17],[13,7,13,9],[13,10,13,12],[22,18,24,18],[23,4,23,6],[23,7,23,9],[23,10,23,12],[23,15,23,17],[25,7,25,9],[25,10,25,12],[44,10,44,12],[44,15,44,17],[59,18,61,18],[60,4,60,6],[60,7,60,9],[60,10,60,12],[60,15,60,17],[43,18,45,18],[149,4,149,6],[149,7,149,9],[149,10,149,12],[149,15,149,17],[124,7,124,9],[124,10,124,12],[107,18,109,18],[44,4,44,6],[44,7,44,9],[110,10,110,12],[47,7,47,9],[47,10,47,12],[76,18,78,18],[77,4,77,6],[77,7,77,9],[77,10,77,12],[151,7,151,9],[151,10,151,12],[169,18,171,18],[170,4,170,6],[170,7,170,9],[170,10,170,12],[170,15,170,17],[179,18,181,18],[180,4,180,6],[180,7,180,9],[180,10,180,12],[180,15,180,17],[192,15,192,17],[202,18,204,18],[203,4,203,6],[203,7,203,9],[203,10,203,12],[203,15,203,17],[159,18,161,18],[160,4,160,6],[160,7,160,9],[160,10,160,12],[160,15,160,17],[172,7,172,9],[172,10,172,12],[366,10,366,12],[366,15,366,17],[262,18,264,18],[263,4,263,6],[263,7,263,9],[263,10,263,12],[263,15,263,17],[273,18,275,18],[274,4,274,6],[274,7,274,9],[274,10,274,12],[274,15,274,17],[305,18,307,18],[306,4,306,6],[306,7,306,9],[347,18,349,18],[348,4,348,6],[348,7,348,9],[348,10,348,12],[348,15,348,17],[355,18,357,18],[285,10,285,12],[285,15,285,17],[295,18,297,18],[444,18,445,18],[46,7,46,9],[46,10,46,12],[394,18,396,18],[395,4,395,6],[395,7,395,9],[395,10,395,12],[395,15,395,17],[324,7,324,9],[324,10,324,12],[324,15,324,17],[335,18,337,18],[336,4,336,6],[336,7,336,9],[336,10,336,12],[336,15,336,17],[384,18,386,18],[323,18,325,18],[324,4,324,6],[376,18,378,18],[377,4,377,6],[365,18,367,18],[366,4,366,6],[366,7,366,9],[92,18,94,18],[93,4,93,6],[93,7,93,9],[93,10,93,12],[93,15,93,17],[96,7,96,9],[96,10,96,12],[356,4,356,6],[356,7,356,9],[356,10,356,12],[237,18,239,18],[238,4,238,6],[238,7,238,9],[238,10,238,12],[238,15,238,17],[251,18,253,18],[252,4,252,6],[252,7,252,9],[252,10,252,12],[252,15,252,17],[191,18,193,18],[192,4,192,6],[192,7,192,9],[192,10,192,12]]}
["COMPARISON TABLE OF NEW AND CONVENTIONAL ",null,null,null,null,null,"* Please refer to the notes and revise it."]
[]
["Select the model you want to refer to and click \"JUMP\"."]
[]
["MODEL"]
["MJ3"]
[]
[]
["【HD2】"]
[]
["MODEL","NAME PLATE ATTACHING DRAWING",null,"CONVENTIONAL",null,null,null,null,null,null,null,null,null,"NEW",null,null,null,null,"REFERENCE"]
["HD2-10,15",757205,null,null,"Japanese",null,null,"English",null,null,"Chinese",null,null,null,null,"CORD(MJ)"]
["HD2-25,50",757206,null,"NAME","NUMBER","DRAWING NUMBER(MJ)","CORD(MJ)","NUMBER","DRAWING NUMBER(MJ)","CORD(MJ)","NUMBER","DRAWING NUMBER(MJ)","CORD(MJ)","NUMBER","DRAWING NUMBER(MJ)","Japanese","English","Chinese"]
["HD2-75,100","A52481 ",null,"ELECTRIC SHOCK HAZARD","3-32","731305/1",14592,"←",null,null,"←",null,null,"Z-019-ZZ",{"$f":"VLOOKUP(N14,'STICKER LIST'!$B$5:$F$33,2,FALSE)","v":"F39248"},{"$f":"VLOOKUP(N14,'STICKER LIST'!$B$5:$F$33,3,FALSE)","v":29767},{"$f":"VLOOKUP(N14,'STICKER LIST'!$B$5:$F$33,4,FALSE)","v":"←"},{"$f":"VLOOKUP(N14,'STICKER LIST'!$B$5:$F$33,5,FALSE)","v":"←"}]
["HD2-150,200",757207,null,"HOT SURFACE","5-11","736246/1",14577,"5-61","737033/1",14599,"5-111",748586,15079,"W-021-□□",{"$f":"VLOOKUP(N15,'STICKER LIST'!$B$5:$F$33,2,FALSE)","v":"F39192"},{"$f":"VLOOKUP(N15,'STICKER LIST'!$B$5:$F$33,3,FALSE)","v":29768},{"$f":"VLOOKUP(N15,'STICKER LIST'!$B$5:$F$33,4,FALSE)","v":29769},{"$f":"VLOOKUP(N15,'STICKER LIST'!$B$5:$F$33,5,FALSE)","v":29770}]
["HD2-250,300",757208,null,"HOT SURFACE","5-31-2","736247/3",14583,"5-81","737038/2",14604,"5-131",748590,15088,"Z-029-ZZ",{"$f":"VLOOKUP(N16,'STICKER LIST'!$B$5:$F$33,2,FALSE)","v":"F39249"},{"$f":"VLOOKUP(N16,'STICKER LIST'!$B$5:$F$33,3,FALSE)","v":29771},{"$f":"VLOOKUP(N16,'STICKER LIST'!$B$5:$F$33,4,FALSE)","v":"←"},{"$f":"VLOOKUP(N16,'STICKER LIST'!$B$5:$F$33,5,FALSE)","v":"←"}]
["HD2-400-1100",182118,null,"HOT SURFACE","5-32-1","736248/2",14584,"5-82","737039/2",14605,"5-132",748591,15089,"Z-029-ZZ",{"$f":"VLOOKUP(N17,'STICKER LIST'!$B$5:$F$33,2,FALSE)","v":"F39249"},{"$f":"VLOOKUP(N17,'STICKER LIST'!$B$5:$F$33,3,FALSE)","v":29771},{"$f":"VLOOKUP(N17,'STICKER LIST'!$B$5:$F$33,4,FALSE)","v":"←"},{"$f":"VLOOKUP(N17,'STICKER LIST'!$B$5:$F$33,5,FALSE)","v":"←"}]
[null,null,null,"DRYING EQUIPMENT","5-25","736245/1",14581,"-","-","-","-","-","-","DELETE",null,null,null,null,"Used for more than 150 in Japan. Write details in the instruction manual."]
[]
[]
["【HD】"]
[]
["MODEL","NAME PLATE ATTACHING DRAWING",null,"CONVENTIONAL",null,null,null,null,null,null,null,null,null,"NEW",null,null,null,null,"REFERENCE"]
["HD-10,15","A54090",null,null,"Japanese",null,null,"English",null,null,"Chinese",null,null,null,null,"CORD(MJ)"]
["HD-25,50","A54091",null,"NAME","NUMBER","DRAWING NUMBER(MJ)","CORD(MJ)","NUMBER","DRAWING NUMBER(MJ)","CORD(MJ)","NUMBER","DRAWING NUMBER(MJ)","CORD(MJ)","NUMBER","DRAWING NUMBER(MJ)","Japanese","English","Chinese"]
["HD-75,100","A54092",null,"ELECTRIC SHOCK HAZARD","3-32","731305/1",14592,"←",null,null,"←",null,null,"Z-019-ZZ",{"$f":"VLOOKUP(N26,'STICKER LIST'!$B$5:$F$33,2,FALSE)","v":"F39248"},{"$f":"VLOOKUP(N26,'STICKER LIST'!$B$5:$F$33,3,FALSE)","v":29767},{"$f":"VLOOKUP(N26,'STICKER LIST'!$B$5:$F$33,4,FALSE)","v":"←"},{"$f":"VLOOKUP(N26,'STICKER LIST'!$B$5:$F$33,5,FALSE)","v":"←"}]
["HD-150,200","A54093",null,"HOT SURFACE","5-11","736246/1",14577,"5-61","737033/1",14599,"5-111",748586,15079,"W-021-□□",{"$f":"VLOOKUP(N27,'STICKER LIST'!$B$5:$F$33,2,FALSE)","v":"F39192"},{"$f":"VLOOKUP(N27,'STICKER LIST'!$B$5:$F$33,3,FALSE)","v":29768},{"$f":"VLOOKUP(N27,'STICKER LIST'!$B$5:$F$33,4,FALSE)","v":29769},{"$f":"VLOOKUP(N27,'STICKER LIST'!$B$5:$F$33,5,FALSE)","v":29770}]
["HD-250,300","A54094",null,"HOT SURFACE","5-31-2","736247/3",14583,"5-81","737038/2",14604,"5-131",748590,15088,"Z-029-ZZ",{"$f":"VLOOKUP(N28,'STICKER LIST'!$B$5:$F$33,2,FALSE)","v":"F39249"},{"$f":"VLOOKUP(N28,'STICKER LIST'!$B$5:$F$33,3,FALSE)","v":29771},{"$f":"VLOOKUP(N28,'STICKER LIST'!$B$5:$F$33,4,FALSE)","v":"←"},{"$f":"VLOOKUP(N28,'STICKER LIST'!$B$5:$F$33,5,FALSE)","v":"←"}]
["HD-400-1100","A54095",null,"DRYING EQUIPMENT","5-25","736245/1",14581,"-","-","-","-","-","-","DELETE",null,null,null,null,"Used for more than 150 in Japan. Write details in the instruction manual."]
[]
[]
["【PMD】"]
[]
["MODEL","全体図",null,"CONVENTIONAL",null,null,null,null,null,null,null,null,null,"NEW",null,null,null,null,"REFERENCE"]
["-",176713,null,null,"Japanese",null,null,"English",null,null,"Chinese",null,null,null,null,"CORD(MJ)"]
[null,null,null,"NAME","NUMBER","DRAWING NUMBER(MJ)","CORD(MJ)","NUMBER","DRAWING NUMBER(MJ)","CORD(MJ)","NUMBER","DRAWING NUMBER(MJ)","CORD(MJ)","NUMBER","DRAWING NUMBER(MJ)","Japanese","English","Chinese"]
[null,null,null,"ELECTRIC SHOCK HAZARD","5-18-1","736902/1",22128,"5-68","738372/1",14611,"5-118","748599/1",15083,"Z-019-ZZ",{"$f":"VLOOKUP(N37,'STICKER LIST'!$B$5:$F$33,2,FALSE)","v":"F39248"},{"$f":"VLOOKUP(N37,'STICKER LIST'!$B$5:$F$33,3,FALSE)","v":29767},{"$f":"VLOOKUP(N37,'STICKER LIST'!$B$5:$F$33,4,FALSE)","v":"←"},{"$f":"VLOOKUP(N37,'STICKER LIST'!$B$5:$F$33,5,FALSE)","v":"←"},"Described in the control panel drawing."]
[null,null,null,"HOT SURFACE","5-11","736246/1",14577,"5-61","737033/1",14599,"5-111",748586,15079,"W-021-□□",{"$f":"VLOOKUP(N38,'STICKER LIST'!$B$5:$F$33,2,FALSE)","v":"F39192"},{"$f":"VLOOKUP(N38,'STICKER LIST'!$B$5:$F$33,3,FALSE)","v":29768},{"$f":"VLOOKUP(N38,'STICKER LIST'!$B$5:$F$33,4,FALSE)","v":29769},{"$f":"VLOOKUP(N38,'STICKER LIST'!$B$5:$F$33,5,FALSE)","v":29770}]
[null,null,null,"HOT SURFACE","5-32-1","736248/2",14584,"5-82","737039/2",14605,"5-132",748591,15089,"Z-029-ZZ",{"$f":"VLOOKUP(N39,'STICKER LIST'!$B$5:$F$33,2,FALSE)","v":"F39249"},{"$f":"VLOOKUP(N39,'STICKER LIST'!$B$5:$F$33,3,FALSE)","v":29771},{"$f":"VLOOKUP(N39,'STICKER LIST'!$B$5:$F$33,4,FALSE)","v":"←"},{"$f":"VLOOKUP(N39,'STICKER LIST'!$B$5:$F$33,5,FALSE)","v":"←"}]
[]
[]
["【MGD】"]
[]
["MODEL","NAME PLATE ATTACHING DRAWING",null,"CONVENTIONAL",null,null,null,null,null,null,null,null,null,"NEW",null,null,null,null,"REFERENCE"]
["-","F27784",null,null,"Japanese",null,null,"English",null,null,"Chinese",null,null,null,null,"CORD(MJ)"]
[null,null,null,"NAME","NUMBER","DRAWING NUMBER(MJ)","CORD(MJ)","NUMBER","DRAWING NUMBER(MJ)","CORD(MJ)","NUMBER","DRAWING NUMBER(MJ)","CORD(MJ)","NUMBER","DRAWING NUMBER(MJ)","Japanese","English","Chinese"]
[null,null,null,"ELECTRIC SHOCK HAZARD","3-31","731305/1",14591,"←",null,null,"←",null,null,"Z-019-ZZ",{"$f":"VLOOKUP(N47,'STICKER LIST'!$B$5:$F$33,2,FALSE)","v":"F39248"},{"$f":"VLOOKUP(N47,'STICKER LIST'!$B$5:$F$33,3,FALSE)","v":29767},{"$f":"VLOOKUP(N47,'STICKER LIST'!$B$5:$F$33,4,FALSE)","v":"←"},{"$f":"VLOOKUP(N47,'STICKER LIST'!$B$5:$F$33,5,FALSE)","v":"←"},"Use for SE"]
[null,null,null,"ELECTRIC SHOCK HAZARD","3-32","731305/1",14592,"←",null,null,"←",null,null,"Z-019-ZZ",{"$f":"VLOOKUP(N48,'STICKER LIST'!$B$5:$F$33,2,FALSE)","v":"F39248"},{"$f":"VLOOKUP(N48,'STICKER LIST'!$B$5:$F$33,3,FALSE)","v":29767},{"$f":"VLOOKUP(N48,'STICKER LIST'!$B$5:$F$33,4,FALSE)","v":"←"},{"$f":"VLOOKUP(N48,'STICKER LIST'!$B$5:$F$33,5,FALSE)","v":"←"}]
[null,null,null,"HOT SURFACE","5-11","736246/1",14577,"5-61","737033/1",14599,"5-111",748586,15079,"W-021-□□",{"$f":"VLOOKUP(N49,'STICKER LIST'!$B$5:$F$33,2,FALSE)","v":"F39192"},{"$f":"VLOOKUP(N49,'STICKER LIST'!$B$5:$F$33,3,FALSE)","v":29768},{"$f":"VLOOKUP(N49,'STICKER LIST'!$B$5:$F$33,4,FALSE)","v":29769},{"$f":"VLOOKUP(N49,'STICKER LIST'!$B$5:$F$33,5,FALSE)","v":29770}]
[null,null,null,"HOT SURFACE","5-32-1","736248/2",14584,"5-82","737039/2",14605,"5-132",748591,15089,"Z-029-ZZ",{"$f":"VLOOKUP(N50,'STICKER LIST'!$B$5:$F$33,2,FALSE)","v":"F39249"},{"$f":"VLOOKUP(N50,'STICKER LIST'!$B$5:$F$33,3,FALSE)","v":29771},{"$f":"VLOOKUP(N50,'STICKER LIST'!$B$5:$F$33,4,FALSE)","v":"←"},{"$f":"VLOOKUP(N50,'STICKER LIST'!$B$5:$F$33,5,FALSE)","v":"←"}]
[null,null,null,"DON'T MOVE","4-15","A81770",23560,"4-65","A81771",23561,"4-115","A81772",23562,"D-072-□□",{"$f":"VLOOKUP(N51,'STICKER LIST'!$B$5:$F$33,2,FALSE)","v":"F39258"},{"$f":"VLOOKUP(N51,'STICKER LIST'!$B$5:$F$33,3,FALSE)","v":29794},{"$f":"VLOOKUP(N51,'STICKER LIST'!$B$5:$F$33,4,FALSE)","v":29795},{"$f":"VLOOKUP(N51,'STICKER LIST'!$B$5:$F$33,5,FALSE)","v":29796},"Write in the instruction manual that movement is strictly prohibited."]
[null,null,null,"DRYING EQUIPMENT","5-25","736245/1",14581,"-","-","-","-","-","-","DELETE",null,null,null,null,"Use for Japan. Write details in the instruction manual."]
[null,null,null,"HANDLING PRECAUTIONS","6-15-2","731297/3",14586,"6-65-1","737041/3",14607,"6-115","748593/1",15091,"DELETE"]
[null,null,null,"CAUTION Nameplate (MAINTENANCE, CAUTION)","-","190597①","-","-",725455,"-","-","-","-","N-A06-□□",{"$f":"VLOOKUP(N54,'STICKER LIST'!$B$5:$F$33,2,FALSE)","v":"F41736"},{"$f":"VLOOKUP(N54,'STICKER LIST'!$B$5:$F$33,3,FALSE)","v":30390},{"$f":"VLOOKUP(N54,'STICKER LIST'!$B$5:$F$33,4,FALSE)","v":30391},{"$f":"VLOOKUP(N54,'STICKER LIST'!$B$5:$F$33,5,FALSE)","v":30392},"Dust box maintenance"]
[null,null,null,"CAUTION Nameplate (MAINTENANCE)","-","190597②","-","-",190598,"-","-","-","-","N-A05-□□",{"$f":"VLOOKUP(N55,'STICKER LIST'!$B$5:$F$33,2,FALSE)","v":"F41735"},{"$f":"VLOOKUP(N55,'STICKER LIST'!$B$5:$F$33,3,FALSE)","v":30387},{"$f":"VLOOKUP(N55,'STICKER LIST'!$B$5:$F$33,4,FALSE)","v":30388},{"$f":"VLOOKUP(N55,'STICKER LIST'!$B$5:$F$33,5,FALSE)","v":30389},"Filter maintenance"]
[]
[]
["【MJ3】"]
[]
["MODEL","NAME PLATE ATTACHING DRAWING",null,"CONVENTIONAL",null,null,null,null,null,null,null,null,null,"NEW",null,null,null,null,"REFERENCE"]
["10-150","F27079",null,null,"Japanese",null,null,"English",null,null,"Chinese",null,null,null,null,"CORD(MJ)"]
["200-300","F27080",null,"NAME","NUMBER","DRAWING NUMBER(MJ)","CORD(MJ)","NUMBER","DRAWING NUMBER(MJ)","CORD(MJ)","NUMBER","DRAWING NUMBER(MJ)","CORD(MJ)","NUMBER","DRAWING NUMBER(MJ)","Japanese","English","Chinese"]
[null,null,null,"ELECTRIC SHOCK HAZARD","3-31","731305/1",14591,"←",null,null,"←",null,null,"Z-019-ZZ",{"$f":"VLOOKUP(N63,'STICKER LIST'!$B$5:$F$33,2,FALSE)","v":"F39248"},{"$f":"VLOOKUP(N63,'STICKER LIST'!$B$5:$F$33,3,FALSE)","v":29767},{"$f":"VLOOKUP(N63,'STICKER LIST'!$B$5:$F$33,4,FALSE)","v":"←"},{"$f":"VLOOKUP(N63,'STICKER LIST'!$B$5:$F$33,5,FALSE)","v":"←"},"Use for SE"]
[null,null,null,"ELECTRIC SHOCK HAZARD","3-32","731305/1",14592,"←",null,null,"←",null,null,"Z-019-ZZ",{"$f":"VLOOKUP(N64,'STICKER LIST'!$B$5:$F$33,2,FALSE)","v":"F39248"},{"$f":"VLOOKUP(N64,'STICKER LIST'!$B$5:$F$33,3,FALSE)","v":29767},{"$f":"VLOOKUP(N64,'STICKER LIST'!$B$5:$F$33,4,FALSE)","v":"←"},{"$f":"VLOOKUP(N64,'STICKER LIST'!$B$5:$F$33,5,FALSE)","v":"←"}]
[null,null,null,"HOT SURFACE","5-11","736246/1",14577,"5-61","737033/1",14599,"5-111",748586,15079,"W-021-□□",{"$f":"VLOOKUP(N65,'STICKER LIST'!$B$5:$F$33,2,FALSE)","v":"F39192"},{"$f":"VLOOKUP(N65,'STICKER LIST'!$B$5:$F$33,3,FALSE)","v":29768},{"$f":"VLOOKUP(N65,'STICKER LIST'!$B$5:$F$33,4,FALSE)","v":29769},{"$f":"VLOOKUP(N65,'STICKER LIST'!$B$5:$F$33,5,FALSE)","v":29770}]
[null,null,null,"HOT SURFACE","5-31-2","736247/3",14583,"5-81","737038/2",14604,"5-131",748590,15088,"W-021-□□",{"$f":"VLOOKUP(N66,'STICKER LIST'!$B$5:$F$33,2,FALSE)","v":"F39192"},{"$f":"VLOOKUP(N66,'STICKER LIST'!$B$5:$F$33,3,FALSE)","v":29768},{"$f":"VLOOKUP(N66,'STICKER LIST'!$B$5:$F$33,4,FALSE)","v":29769},{"$f":"VLOOKUP(N66,'STICKER LIST'!$B$5:$F$33,5,FALSE)","v":29770},"Used for less than 150"]
[null,null,null,"DON'T MOVE","4-15","A81770",23560,"4-65","A81771",23561,"4-115","A81772",23562,"D-072-□□",{"$f":"VLOOKUP(N67,'STICKER LIST'!$B$5:$F$33,2,FALSE)","v":"F39258"},{"$f":"VLOOKUP(N67,'STICKER LIST'!$B$5:$F$33,3,FALSE)","v":29794},{"$f":"VLOOKUP(N67,'STICKER LIST'!$B$5:$F$33,4,FALSE)","v":29795},{"$f":"VLOOKUP(N67,'STICKER LIST'!$B$5:$F$33,5,FALSE)","v":29796},"Write in the instruction manual that movement is strictly prohibited."]
[null,null,null,"DRYING EQUIPMENT","5-25","736245/1",14581,"-","-","-","-","-","-","DELETE",null,null,null,null,"Used for more than 200 in Japan. Write details in the instruction manual."]
[null,null,null,"HANDLING PRECAUTIONS","6-15-2","731297/3",14586,"6-65-1","737041/3",14607,"6-115","748593/1",15091,"DELETE"]
[null,null,null,"PRECAUTIONS WHEN DRIVING","6-28","A00068",21998,"6-78","A06465",21999,"-","-","-","DELETE",null,null,null,null,"Write details in the instruction manual."]
[null,null,null,"FILTER MAINTENANCE","-","-",20466,"-","-","-","-","-","-","N-A05-□□",{"$f":"VLOOKUP(N71,'STICKER LIST'!$B$5:$F$33,2,FALSE)","v":"F41735"},{"$f":"VLOOKUP(N71,'STICKER LIST'!$B$5:$F$33,3,FALSE)","v":30387},{"$f":"VLOOKUP(N71,'STICKER LIST'!$B$5:$F$33,4,FALSE)","v":30388},{"$f":"VLOOKUP(N71,'STICKER LIST'!$B$5:$F$33,5,FALSE)","v":30389},"There is no description of cord (MJ) in the drawing."]
[null,null,null,"DUST BOX MAINTENANCE","-","-","-","-","-","-","-","-","-","N-A06-□□","F41736",30390,30391,30392,"Used for Cyclone(new)"]
[]
[]
["【MJ5-i】"]
[]
["MODEL","NAME PLATE ATTACHING DRAWING",null,"CONVENTIONAL",null,null,null,null,null,null,null,null,null,"NEW",null,null,null,null,"REFERENCE"]
["150-650","B23384",null,null,"Japanese",null,null,"English",null,null,"Chinese",null,null,null,null,"CORD(MJ)"]
[1500,"B71453 ",null,"NAME","NUMBER","DRAWING NUMBER(MJ)","CORD(MJ)","NUMBER","DRAWING NUMBER(MJ)","CORD(MJ)","NUMBER","DRAWING NUMBER(MJ)","CORD(MJ)","NUMBER","DRAWING NUMBER(MJ)","Japanese","English","Chinese"]
[null,null,null,"ELECTRIC SHOCK HAZARD","5-17-1","736903/1",14596,"5-67",738371,14610,"5-117",748598,15082,"Z-019-ZZ",{"$f":"VLOOKUP(N80,'STICKER LIST'!$B$5:$F$33,2,FALSE)","v":"F39248"},{"$f":"VLOOKUP(N80,'STICKER LIST'!$B$5:$F$33,3,FALSE)","v":29767},{"$f":"VLOOKUP(N80,'STICKER LIST'!$B$5:$F$33,4,FALSE)","v":"←"},{"$f":"VLOOKUP(N80,'STICKER LIST'!$B$5:$F$33,5,FALSE)","v":"←"}]
[null,null,null,"HOT SURFACE","5-11","736246/1",14577,"5-61","737033/1",14599,"5-111",748586,15079,"W-021-□□",{"$f":"VLOOKUP(N81,'STICKER LIST'!$B$5:$F$33,2,FALSE)","v":"F39192"},{"$f":"VLOOKUP(N81,'STICKER LIST'!$B$5:$F$33,3,FALSE)","v":29768},{"$f":"VLOOKUP(N81,'STICKER LIST'!$B$5:$F$33,4,FALSE)","v":29769},{"$f":"VLOOKUP(N81,'STICKER LIST'!$B$5:$F$33,5,FALSE)","v":29770}]
[null,null,null,"HOT SURFACE","5-32-1","736248/2",14584,"5-82","737039/2",14605,"5-132",748591,15089,"Z-029-ZZ",{"$f":"VLOOKUP(N82,'STICKER LIST'!$B$5:$F$33,2,FALSE)","v":"F39249"},{"$f":"VLOOKUP(N82,'STICKER LIST'!$B$5:$F$33,3,FALSE)","v":29771},{"$f":"VLOOKUP(N82,'STICKER LIST'!$B$5:$F$33,4,FALSE)","v":"←"},{"$f":"VLOOKUP(N82,'STICKER LIST'!$B$5:$F$33,5,FALSE)","v":"←"}]
[null,null,null,"DON'T MOVE","4-15","A81770",23560,"4-65","A81771",23561,"4-115","A81772",23562,"D-072-□□",{"$f":"VLOOKUP(N83,'STICKER LIST'!$B$5:$F$33,2,FALSE)","v":"F39258"},{"$f":"VLOOKUP(N83,'STICKER LIST'!$B$5:$F$33,3,FALSE)","v":29794},{"$f":"VLOOKUP(N83,'STICKER LIST'!$B$5:$F$33,4,FALSE)","v":29795},{"$f":"VLOOKUP(N83,'STICKER LIST'!$B$5:$F$33,5,FALSE)","v":29796},"Write in the instruction manual that movement is strictly prohibited."]
[null,null,null,"DOOR OPEN AND CLOSE ATTENTION","5-501","D35716",28676,"5-551","D35718",28678,"5-601","D35717",28677,"W-101-□□",{"$f":"VLOOKUP(N84,'STICKER LIST'!$B$5:$F$33,2,FALSE)","v":"F39261"},{"$f":"VLOOKUP(N84,'STICKER LIST'!$B$5:$F$33,3,FALSE)","v":29801},{"$f":"VLOOKUP(N84,'STICKER LIST'!$B$5:$F$33,4,FALSE)","v":29802},{"$f":"VLOOKUP(N84,'STICKER LIST'!$B$5:$F$33,5,FALSE)","v":29803},"Write details in the instruction manual."]
[null,null,null,"DRYING EQUIPMENT","5-25","736245/1",14581,"-","-","-","-","-","-","DELETE",null,null,null,null,"Used for more than 1500 in Japan. Write details in the instruction manual."]
[null,null,null,"HANDLING PRECAUTIONS","6-15-2","731297/3",14586,"6-65-1","737041/3",14607,"6-115","748593/1",15091,"DELETE"]
[null,null,null,"CAUTION Nameplate (MAINTENANCE, CAUTION)","-","190597①","-","-",725455,null,"-","-","-","N-A06-□□",{"$f":"VLOOKUP(N87,'STICKER LIST'!$B$5:$F$33,2,FALSE)","v":"F41736"},{"$f":"VLOOKUP(N87,'STICKER LIST'!$B$5:$F$33,3,FALSE)","v":30390},{"$f":"VLOOKUP(N87,'STICKER LIST'!$B$5:$F$33,4,FALSE)","v":30391},{"$f":"VLOOKUP(N87,'STICKER LIST'!$B$5:$F$33,5,FALSE)","v":30392},"Dust box maintenance"]
[null,null,null,"FILTER MAINTENANCE","-","B27634","-","-","-","-","-","-","-","N-A05-□□",{"$f":"VLOOKUP(N88,'STICKER LIST'!$B$5:$F$33,2,FALSE)","v":"F41735"},{"$f":"VLOOKUP(N88,'STICKER LIST'!$B$5:$F$33,3,FALSE)","v":30387},{"$f":"VLOOKUP(N88,'STICKER LIST'!$B$5:$F$33,4,FALSE)","v":30388},{"$f":"VLOOKUP(N88,'STICKER LIST'!$B$5:$F$33,5,FALSE)","v":30389}]
[]
[]
["【NTD】"]
[]
["機種","銘板貼付指示図",null,"旧ステッカー",null,null,null,null,null,null,null,null,null,"新ステッカー",null,null,null,null,"備考"]
["-","B98084",null,null,"和文",null,null,"英文",null,null,"中文",null,null,null,null,"コード"]
[null,null,null,"名称","管理番号","図番","コード","管理番号","図番","コード","管理番号","図番","コード","管理番号","図番","和文","英文","中文"]
[null,null,null,"ELECTRIC SHOCK HAZARD","5-18-1","736902/1",22128,"5-68","738372/1",14611,"5-118","748599/1",15083,"Z-019-ZZ","F39248",29767,"←","←"]
[null,null,null,"ELECTRIC SHOCK HAZARD","3-31","731305/1",14591,"←",null,null,"←",null,null,"Z-019-ZZ","F39248",29767,"←","←"]
[null,null,null,"HOT SURFACE","5-11","736246/1",14577,"5-61","737033/1",14599,"5-111","M990138①","-","W-021-□□","F39192",29768,29769,29770,"Chinese drawing number is CMC drawing number"]
[null,null,null,"HOT SURFACE","5-31-2","736247/3",14583,"5-81","737038/2",14604,"5-131","M990009①","-","Z-029-ZZ","F39249",29771,"←","←","Chinese drawing number is CMC drawing number"]
[null,null,null,"HOT SURFACE","5-32-1","736248/2",14584,"5-82","737039/2",14605,"5-132","M990137①","-","Z-029-ZZ","F39249",29771,"←","←","Chinese drawing number is CMC drawing number"]
[null,null,null,"DON'T MOVE","4-15","A81770",23560,"4-65","A81771",23561,"4-115","CA81772","-","D-072-□□","F39258",29794,29795,29796,"Chinese drawing number is CMC drawing number. Write details in the instruction manual."]
[null,null,null,"HANDLING PRECAUTIONS","6-15-2","731297/3",14586,"6-65",737041,14607,"6-115","M990001①","-","削除",null,null,null,null,"Chinese drawing number is CMC drawing number"]
[null,null,null,"FILTER MAINTENANCE","-","B27634","-","-","-","-","-","M990156","-","N-A05-□□","F41735",30387,30388,30389,"Chinese drawing number is CMC drawing number"]
[]
[]
["【DMZ2】"]
[]
["MODEL","NAME PLATE ATTACHING DRAWING",null,"CONVENTIONAL",null,null,null,null,null,null,null,null,null,"NEW",null,null,null,null,"REFERENCE"]
[40,"F27804",null,null,"Japanese",null,null,"English",null,null,"Chinese",null,null,null,null,"CORD(MJ)"]
[80120,"F27805",null,"NAME","NUMBER","DRAWING NUMBER(MJ)","CORD(MJ)","NUMBER","DRAWING NUMBER(MJ)","CORD(MJ)","NUMBER","DRAWING NUMBER(MJ)","CORD(MJ)","NUMBER","DRAWING NUMBER(MJ)","Japanese","English","Chinese"]
[170240,"F27806",null,"ELECTRIC SHOCK HAZARD","3-32","731305/1",14592,"←",null,null,"←",null,null,"Z-019-ZZ",{"$f":"VLOOKUP(N111,'STICKER LIST'!$B$5:$F$33,2,FALSE)","v":"F39248"},{"$f":"VLOOKUP(N111,'STICKER LIST'!$B$5:$F$33,3,FALSE)","v":29767},{"$f":"VLOOKUP(N111,'STICKER LIST'!$B$5:$F$33,4,FALSE)","v":"←"},{"$f":"VLOOKUP(N111,'STICKER LIST'!$B$5:$F$33,5,FALSE)","v":"←"}]
[500700,"F27831",null,"ELECTRIC SHOCK HAZARD","5-16-1","736249/1",14578,"5-66",737034,14600,"5-116","748601/1",15081,"In principle, DELETE",null,null,null,null,"Because it is close to the 3-32 position.\nBut, If it is not close to the 3-32 position, change to Z-019-ZZ."]
[900,"F27832",null,"HOT SURFACE","5-31-2","736247/3",14583,"5-81","737038/2",14604,"5-131",748590,15088,"W-021-□□",{"$f":"VLOOKUP(N113,'STICKER LIST'!$B$5:$F$33,2,FALSE)","v":"F39192"},{"$f":"VLOOKUP(N113,'STICKER LIST'!$B$5:$F$33,3,FALSE)","v":29768},{"$f":"VLOOKUP(N113,'STICKER LIST'!$B$5:$F$33,4,FALSE)","v":29769},{"$f":"VLOOKUP(N113,'STICKER LIST'!$B$5:$F$33,5,FALSE)","v":29770}]
[null,null,null,"DRYING EQUIPMENT","5-25","736245/1",14581,"-","-","-","-","-","-","DELETE",null,null,null,null,"Used for more than 170 in Japan. Write details in the instruction manual"]
[null,null,null,"HANDLING PRECAUTIONS","6-15-2","731297/3",14586,"6-65-1","737041/3",14607,"6-115","748593/1",15091,"DELETE"]
[null,null,null,"PRECAUTIONS WHEN DRIVING","6-28","A00068",21998,"6-78","A06465",21999,"-","-","-","DELETE",null,null,null,null,"Write details in the instruction manual"]
[null,null,null,"FILTER MAINTENANCE","-","-",20466,"-","-","-","-","-","-","N-A05-□□",{"$f":"VLOOKUP(N117,'STICKER LIST'!$B$5:$F$33,2,FALSE)","v":"F41735"},{"$f":"VLOOKUP(N117,'STICKER LIST'!$B$5:$F$33,3,FALSE)","v":30387},{"$f":"VLOOKUP(N117,'STICKER LIST'!$B$5:$F$33,4,FALSE)","v":30388},{"$f":"VLOOKUP(N117,'STICKER LIST'!$B$5:$F$33,5,FALSE)","v":30389},"There is no description of cord (MJ) in the drawing."]
[]
[]
["【DMD4】"]
[]
["MODEL","NAME PLATE ATTACHING DRAWING",null,"CONVENTIONAL",null,null,null,null,null,null,null,null,null,"NEW",null,null,null,null,"REFERENCE"]
["25-200","F27163",null,null,"Japanese",null,null,"English",null,null,"Chinese",null,null,null,null,"CORD(MJ)"]
[300,"F27164",null,"NAME","NUMBER","DRAWING NUMBER(MJ)","CORD(MJ)","NUMBER","DRAWING NUMBER(MJ)","CORD(MJ)","NUMBER","DRAWING NUMBER(MJ)","CORD(MJ)","NUMBER","DRAWING NUMBER(MJ)","Japanese","English","Chinese"]
[null,null,null,"ELECTRIC SHOCK HAZARD","3-32","731305/1",14592,"←",null,null,"←",null,null,"Z-019-ZZ",{"$f":"VLOOKUP(N125,'STICKER LIST'!$B$5:$F$33,2,FALSE)","v":"F39248"},{"$f":"VLOOKUP(N125,'STICKER LIST'!$B$5:$F$33,3,FALSE)","v":29767},{"$f":"VLOOKUP(N125,'STICKER LIST'!$B$5:$F$33,4,FALSE)","v":"←"},{"$f":"VLOOKUP(N125,'STICKER LIST'!$B$5:$F$33,5,FALSE)","v":"←"}]
[null,null,null,"HOT SURFACE","5-11","736246/1",14577,"5-61","737033/1",14599,"5-111",748586,15079,"W-021-□□",{"$f":"VLOOKUP(N126,'STICKER LIST'!$B$5:$F$33,2,FALSE)","v":"F39192"},{"$f":"VLOOKUP(N126,'STICKER LIST'!$B$5:$F$33,3,FALSE)","v":29768},{"$f":"VLOOKUP(N126,'STICKER LIST'!$B$5:$F$33,4,FALSE)","v":29769},{"$f":"VLOOKUP(N126,'STICKER LIST'!$B$5:$F$33,5,FALSE)","v":29770}]
[null,null,null,"HOT SURFACE","5-31-2","736247/3",14583,"5-81","737038/2",14604,"5-131",748590,15088,"W-021-□□",{"$f":"VLOOKUP(N127,'STICKER LIST'!$B$5:$F$33,2,FALSE)","v":"F39192"},{"$f":"VLOOKUP(N127,'STICKER LIST'!$B$5:$F$33,3,FALSE)","v":29768},{"$f":"VLOOKUP(N127,'STICKER LIST'!$B$5:$F$33,4,FALSE)","v":29769},{"$f":"VLOOKUP(N127,'STICKER LIST'!$B$5:$F$33,5,FALSE)","v":29770}]
[null,null,null,"MOVING PARTS","6-21-1","731303/2",14587,"6-71","737042/2",14608,"6-121","748594/1",15093,"W-041-□□",{"$f":"VLOOKUP(N128,'STICKER LIST'!$B$5:$F$33,2,FALSE)","v":"F39253"},{"$f":"VLOOKUP(N128,'STICKER LIST'!$B$5:$F$33,3,FALSE)","v":29779},{"$f":"VLOOKUP(N128,'STICKER LIST'!$B$5:$F$33,4,FALSE)","v":29780},{"$f":"VLOOKUP(N128,'STICKER LIST'!$B$5:$F$33,5,FALSE)","v":29781}]
[null,null,null,"HANDLING PRECAUTIONS","6-15-2","731297/3",14586,"6-65-1","737041/3",14607,"6-115","748593/1",15091,"DELETE"]
[null,null,null,"PRECAUTIONS WHEN DRIVING","6-28","A00068",21998,"6-78","A06465",21999,"-","F31909","-","DELETE",null,null,null,null,"Write details in the instruction manual."]
[null,null,null,"FILTER MAINTENANCE","-","-",20466,"-","-","-","-","F31908","-","N-A05-□□",{"$f":"VLOOKUP(N131,'STICKER LIST'!$B$5:$F$33,2,FALSE)","v":"F41735"},{"$f":"VLOOKUP(N131,'STICKER LIST'!$B$5:$F$33,3,FALSE)","v":30387},{"$f":"VLOOKUP(N131,'STICKER LIST'!$B$5:$F$33,4,FALSE)","v":30388},{"$f":"VLOOKUP(N131,'STICKER LIST'!$B$5:$F$33,5,FALSE)","v":30389},"There is no description of cord (MJ) in the drawing."]
[]
[]
["【DPD3.1】"]
[]
["MODEL","NAME PLATE ATTACHING DRAWING",null,"CONVENTIONAL",null,null,null,null,null,null,null,null,null,"NEW",null,null,null,null,"REFERENCE"]
["-","B38378 ",null,null,"Japanese",null,null,"English",null,null,"Chinese",null,null,null,null,"CORD(MJ)"]
[null,null,null,"NAME","NUMBER","DRAWING NUMBER(MJ)","CORD(MJ)","NUMBER","DRAWING NUMBER(MJ)","CORD(MJ)","NUMBER","DRAWING NUMBER(MJ)","CORD(MJ)","NUMBER","DRAWING NUMBER(MJ)","Japanese","English","Chinese"]
[null,null,null,"ELECTRIC SHOCK HAZARD","5-18-1","736902/1",22128,"5-68","738372/1",14611,"5-118","748599/1",15083,"Z-019-ZZ",{"$f":"VLOOKUP(N139,'STICKER LIST'!$B$5:$F$33,2,FALSE)","v":"F39248"},{"$f":"VLOOKUP(N139,'STICKER LIST'!$B$5:$F$33,3,FALSE)","v":29767},{"$f":"VLOOKUP(N139,'STICKER LIST'!$B$5:$F$33,4,FALSE)","v":"←"},{"$f":"VLOOKUP(N139,'STICKER LIST'!$B$5:$F$33,5,FALSE)","v":"←"}]
[null,null,null,"HOT SURFACE","5-11","736246/1",14577,"5-61","737033/1",14599,"5-111",748586,15079,"W-021-□□",{"$f":"VLOOKUP(N140,'STICKER LIST'!$B$5:$F$33,2,FALSE)","v":"F39192"},{"$f":"VLOOKUP(N140,'STICKER LIST'!$B$5:$F$33,3,FALSE)","v":29768},{"$f":"VLOOKUP(N140,'STICKER LIST'!$B$5:$F$33,4,FALSE)","v":29769},{"$f":"VLOOKUP(N140,'STICKER LIST'!$B$5:$F$33,5,FALSE)","v":29770}]
[null,null,null,"HOT SURFACE","5-32-1","736248/2",14584,"5-82","737039/2",14605,"5-132",748591,15089,"Z-029-ZZ",{"$f":"VLOOKUP(N141,'STICKER LIST'!$B$5:$F$33,2,FALSE)","v":"F39249"},{"$f":"VLOOKUP(N141,'STICKER LIST'!$B$5:$F$33,3,FALSE)","v":29771},{"$f":"VLOOKUP(N141,'STICKER LIST'!$B$5:$F$33,4,FALSE)","v":"←"},{"$f":"VLOOKUP(N141,'STICKER LIST'!$B$5:$F$33,5,FALSE)","v":"←"}]
[null,null,null,"ROTATING PARTS, MOVING PARTS, OPEN/CLOSE PRECAUTIONS","5-29",736244,14582,"5-79","737037/1",14603,"5-129","748589/1",15087,"W-041-□□",{"$f":"VLOOKUP(N142,'STICKER LIST'!$B$5:$F$33,2,FALSE)","v":"F39253"},{"$f":"VLOOKUP(N142,'STICKER LIST'!$B$5:$F$33,3,FALSE)","v":29779},{"$f":"VLOOKUP(N142,'STICKER LIST'!$B$5:$F$33,4,FALSE)","v":29780},{"$f":"VLOOKUP(N142,'STICKER LIST'!$B$5:$F$33,5,FALSE)","v":29781},"Chinese drawing number(MJ) in name plate attaching drawing is Clerical error."]
[null,null,null,"HANDLING PRECAUTIONS","6-15-2","731297/3",14586,"6-65-1","737041/3",14607,"6-115","748593/1",15091,"DELETE"]
[null,null,null,"CAUTION Nameplate (MAINTENANCE)","-",190597,"-","-",190598,"-","-","A91997","-","N-A05-□□",{"$f":"VLOOKUP(N144,'STICKER LIST'!$B$5:$F$33,2,FALSE)","v":"F41735"},{"$f":"VLOOKUP(N144,'STICKER LIST'!$B$5:$F$33,3,FALSE)","v":30387},{"$f":"VLOOKUP(N144,'STICKER LIST'!$B$5:$F$33,4,FALSE)","v":30388},{"$f":"VLOOKUP(N144,'STICKER LIST'!$B$5:$F$33,5,FALSE)","v":30389},"Filter maintenance"]
[]
[]
["【PO】"]
[]
["MODEL","NAME PLATE ATTACHING DRAWING",null,"CONVENTIONAL",null,null,null,null,null,null,null,null,null,"NEW",null,null,null,null,"REFERENCE"]
["-",752308,null,null,"Japanese",null,null,"English",null,null,"Chinese",null,null,null,null,"CORD(MJ)"]
[null,null,null,"NAME","NUMBER","DRAWING NUMBER(MJ)","CORD(MJ)","NUMBER","DRAWING NUMBER(MJ)","CORD(MJ)","NUMBER","DRAWING NUMBER(MJ)","CORD(MJ)","NUMBER","DRAWING NUMBER(MJ)","Japanese","English","Chinese"]
[null,null,null,"ELECTRIC SHOCK HAZARD","3-32","731305/1",14592,"←",null,null,"←",null,null,"Z-019-ZZ",{"$f":"VLOOKUP(N152,'STICKER LIST'!$B$5:$F$33,2,FALSE)","v":"F39248"},{"$f":"VLOOKUP(N152,'STICKER LIST'!$B$5:$F$33,3,FALSE)","v":29767},{"$f":"VLOOKUP(N152,'STICKER LIST'!$B$5:$F$33,4,FALSE)","v":"←"},{"$f":"VLOOKUP(N152,'STICKER LIST'!$B$5:$F$33,5,FALSE)","v":"←"}]
[null,null,null,"HOT SURFACE","5-11","736246/1",14577,"5-61","737033/1",14599,"5-111",748586,15079,"W-021-□□",{"$f":"VLOOKUP(N153,'STICKER LIST'!$B$5:$F$33,2,FALSE)","v":"F39192"},{"$f":"VLOOKUP(N153,'STICKER LIST'!$B$5:$F$33,3,FALSE)","v":29768},{"$f":"VLOOKUP(N153,'STICKER LIST'!$B$5:$F$33,4,FALSE)","v":29769},{"$f":"VLOOKUP(N153,'STICKER LIST'!$B$5:$F$33,5,FALSE)","v":29770}]
[null,null,null,"DO NOT USE FLAMMABLE MATERIAL","5-43",794174,19412,"5-93",797084,28663,"-","-","-","W-111-□□",{"$f":"VLOOKUP(N154,'STICKER LIST'!$B$5:$F$33,2,FALSE)","v":"F39262"},{"$f":"VLOOKUP(N154,'STICKER LIST'!$B$5:$F$33,3,FALSE)","v":29804},{"$f":"VLOOKUP(N154,'STICKER LIST'!$B$5:$F$33,4,FALSE)","v":29805},{"$f":"VLOOKUP(N154,'STICKER LIST'!$B$5:$F$33,5,FALSE)","v":29806}]
[null,null,null,"DRYING EQUIPMENT","5-25","736245/1",14581,"-","-","-","-","-","-","DELETE",null,null,null,null,"Used for 200H and 200SH in Japan. Write details in the instruction manual."]
[]
[]
["【JL4】"]
[]
["MODEL","NAME PLATE ATTACHING DRAWING",null,"CONVENTIONAL",null,null,null,null,null,null,null,null,null,"NEW",null,null,null,null,"REFERENCE"]
["-",190596,null,null,"Japanese",null,null,"English",null,null,"Chinese",null,null,null,null,"CORD(MJ)"]
[null,null,null,"NAME","NUMBER","DRAWING NUMBER(MJ)","CORD(MJ)","NUMBER","DRAWING NUMBER(MJ)","CORD(MJ)","NUMBER","DRAWING NUMBER(MJ)","CORD(MJ)","NUMBER","DRAWING NUMBER(MJ)","Japanese","English","Chinese"]
[null,null,null,"ELECTRIC SHOCK HAZARD","3-32","731305/1",14592,"←",null,null,"←",null,null,"Z-019-ZZ",{"$f":"VLOOKUP(N163,'STICKER LIST'!$B$5:$F$33,2,FALSE)","v":"F39248"},{"$f":"VLOOKUP(N163,'STICKER LIST'!$B$5:$F$33,3,FALSE)","v":29767},{"$f":"VLOOKUP(N163,'STICKER LIST'!$B$5:$F$33,4,FALSE)","v":"←"},{"$f":"VLOOKUP(N163,'STICKER LIST'!$B$5:$F$33,5,FALSE)","v":"←"}]
[null,null,null,"CAUTION Nameplate (MAINTENANCE, CAUTION)","-","190597①","-","-","A55026","-","-","D25835","-","N-A06-□□",{"$f":"VLOOKUP(N164,'STICKER LIST'!$B$5:$F$33,2,FALSE)","v":"F41736"},{"$f":"VLOOKUP(N164,'STICKER LIST'!$B$5:$F$33,3,FALSE)","v":30390},{"$f":"VLOOKUP(N164,'STICKER LIST'!$B$5:$F$33,4,FALSE)","v":30391},{"$f":"VLOOKUP(N164,'STICKER LIST'!$B$5:$F$33,5,FALSE)","v":30392},"Dust box maintenance"]
[null,null,null,"CAUTION Nameplate (MAINTENANCE)","-","190597②","-","-",190598,"-","-","D25834","-","N-A05-□□",{"$f":"VLOOKUP(N165,'STICKER LIST'!$B$5:$F$33,2,FALSE)","v":"F41735"},{"$f":"VLOOKUP(N165,'STICKER LIST'!$B$5:$F$33,3,FALSE)","v":30387},{"$f":"VLOOKUP(N165,'STICKER LIST'!$B$5:$F$33,4,FALSE)","v":30388},{"$f":"VLOOKUP(N165,'STICKER LIST'!$B$5:$F$33,5,FALSE)","v":30389},"Filter maintenance"]
[]
[]
["【PLP】"]
[]
["MODEL","NAME PLATE ATTACHING DRAWING",null,"CONVENTIONAL",null,null,null,null,null,null,null,null,null,"NEW",null,null,null,null,"REFERENCE"]
["PL-C1（Japanese）","A54437",null,null,"Japanese",null,null,"English",null,null,"Chinese",null,null,null,null,"CORD(MJ)"]
["PL-C1（English）","A54438",null,"NAME","NUMBER","DRAWING NUMBER(MJ)","CORD(MJ)","NUMBER","DRAWING NUMBER(MJ)","CORD(MJ)","NUMBER","DRAWING NUMBER(MJ)","CORD(MJ)","NUMBER","DRAWING NUMBER(MJ)","Japanese","English","Chinese"]
["PL-C2","A54441",null,"ELECTRIC SHOCK HAZARD","3-31","731305/1",14591,"←",null,null,"←",null,null,"Z-019-ZZ",{"$f":"VLOOKUP(N173,'STICKER LIST'!$B$5:$F$33,2,FALSE)","v":"F39248"},{"$f":"VLOOKUP(N173,'STICKER LIST'!$B$5:$F$33,3,FALSE)","v":29767},{"$f":"VLOOKUP(N173,'STICKER LIST'!$B$5:$F$33,4,FALSE)","v":"←"},{"$f":"VLOOKUP(N173,'STICKER LIST'!$B$5:$F$33,5,FALSE)","v":"←"},"Used for PL-C1and PL-C2"]
["PL-C3","A54442",null,"ELECTRIC SHOCK HAZARD","5-18-1","736902/1",22128,"5-68","738372/1",14611,"5-118","748599/1",15083,"Z-019-ZZ",{"$f":"VLOOKUP(N174,'STICKER LIST'!$B$5:$F$33,2,FALSE)","v":"F39248"},{"$f":"VLOOKUP(N174,'STICKER LIST'!$B$5:$F$33,3,FALSE)","v":29767},{"$f":"VLOOKUP(N174,'STICKER LIST'!$B$5:$F$33,4,FALSE)","v":"←"},{"$f":"VLOOKUP(N174,'STICKER LIST'!$B$5:$F$33,5,FALSE)","v":"←"},"Used for PL-C3"]
[]
[]
[]
["【MC5-25/55/88】"]
[]
["MODEL","NAME PLATE ATTACHING DRAWING",null,"CONVENTIONAL",null,null,null,null,null,null,null,null,null,"NEW",null,null,null,null,"REFERENCE"]
[25,"D09747",null,null,"Japanese",null,null,"English",null,null,"Chinese",null,null,null,null,"CORD(MJ)"]
["55,88","D09748",null,"NAME","NUMBER","DRAWING NUMBER(MJ)","CORD(MJ)","NUMBER","DRAWING NUMBER(MJ)","CORD(MJ)","NUMBER","DRAWING NUMBER(MJ)","CORD(MJ)","NUMBER","DRAWING NUMBER(MJ)","Japanese","English","Chinese"]
[null,null,null,"ELECTRIC SHOCK HAZARD","3-31","731305/1",14591,"←",null,null,"←",null,null,"Z-019-ZZ",{"$f":"VLOOKUP(N183,'STICKER LIST'!$B$5:$F$33,2,FALSE)","v":"F39248"},{"$f":"VLOOKUP(N183,'STICKER LIST'!$B$5:$F$33,3,FALSE)","v":29767},{"$f":"VLOOKUP(N183,'STICKER LIST'!$B$5:$F$33,4,FALSE)","v":"←"},{"$f":"VLOOKUP(N183,'STICKER LIST'!$B$5:$F$33,5,FALSE)","v":"←"},"Used for G3"]
[null,null,null,"ELECTRIC SHOCK HAZARD","5-19","D09718",27398,"5-69","D09718",27399,"5-119","D10460",27404,"Z-019-ZZ",{"$f":"VLOOKUP(N184,'STICKER LIST'!$B$5:$F$33,2,FALSE)","v":"F39248"},{"$f":"VLOOKUP(N184,'STICKER LIST'!$B$5:$F$33,3,FALSE)","v":29767},{"$f":"VLOOKUP(N184,'STICKER LIST'!$B$5:$F$33,4,FALSE)","v":"←"},{"$f":"VLOOKUP(N184,'STICKER LIST'!$B$5:$F$33,5,FALSE)","v":"←"},"Used for G1"]
[null,null,null,"HOT SURFACE","5-33","D09719",27393,"5-83","D09719",27394,"5-133","D10461",27395,"Z-029-ZZ",{"$f":"VLOOKUP(N185,'STICKER LIST'!$B$5:$F$33,2,FALSE)","v":"F39249"},{"$f":"VLOOKUP(N185,'STICKER LIST'!$B$5:$F$33,3,FALSE)","v":29771},{"$f":"VLOOKUP(N185,'STICKER LIST'!$B$5:$F$33,4,FALSE)","v":"←"},{"$f":"VLOOKUP(N185,'STICKER LIST'!$B$5:$F$33,5,FALSE)","v":"←"}]
[null,null,null,"HANDLING PRECAUTIONS","6-16","D09721",27385,"6-66","D09721",27386,"6-116","D10463/1",27387,"DELETE"]
[null,null,null,"HANDLING PRECAUTIONS","7-10","D09720/1",27388,"7-60","D09720/1",27389,"7-110","D10462/3",27390,"N-A03-□□",{"$f":"VLOOKUP(N187,'STICKER LIST'!$B$5:$F$33,2,FALSE)","v":"F39264"},{"$f":"VLOOKUP(N187,'STICKER LIST'!$B$5:$F$33,3,FALSE)","v":29813},{"$f":"VLOOKUP(N187,'STICKER LIST'!$B$5:$F$33,4,FALSE)","v":29814},{"$f":"VLOOKUP(N187,'STICKER LIST'!$B$5:$F$33,5,FALSE)","v":29815}]
[]
[]
["【MC-25/55/88】"]
[]
["MODEL","NAME PLATE ATTACHING DRAWING",null,"CONVENTIONAL",null,null,null,null,null,null,null,null,null,"NEW",null,null,null,null,"REFERENCE"]
[25,"A54860",null,null,"Japanese",null,null,"English",null,null,"Chinese",null,null,null,null,"CORD(MJ)"]
[55,"A53978",null,"NAME","NUMBER","DRAWING NUMBER(MJ)","CORD(MJ)","NUMBER","DRAWING NUMBER(MJ)","CORD(MJ)","NUMBER","DRAWING NUMBER(MJ)","CORD(MJ)","NUMBER","DRAWING NUMBER(MJ)","Japanese","English","Chinese"]
[88,"A55202",null,"ELECTRIC SHOCK HAZARD","5-16-1","736249/1",14578,"5-66",737034,14600,"5-116","748601/1",15081,"Z-019-ZZ",{"$f":"VLOOKUP(N195,'STICKER LIST'!$B$5:$F$33,2,FALSE)","v":"F39248"},{"$f":"VLOOKUP(N195,'STICKER LIST'!$B$5:$F$33,3,FALSE)","v":29767},{"$f":"VLOOKUP(N195,'STICKER LIST'!$B$5:$F$33,4,FALSE)","v":"←"},{"$f":"VLOOKUP(N195,'STICKER LIST'!$B$5:$F$33,5,FALSE)","v":"←"}]
[null,null,null,"HOT SURFACE","5-31-2","736247/3",14583,"5-81","737038/2",14604,"5-131",748590,15088,"Z-029-ZZ",{"$f":"VLOOKUP(N196,'STICKER LIST'!$B$5:$F$33,2,FALSE)","v":"F39249"},{"$f":"VLOOKUP(N196,'STICKER LIST'!$B$5:$F$33,3,FALSE)","v":29771},{"$f":"VLOOKUP(N196,'STICKER LIST'!$B$5:$F$33,4,FALSE)","v":"←"},{"$f":"VLOOKUP(N196,'STICKER LIST'!$B$5:$F$33,5,FALSE)","v":"←"}]
[null,null,null,"HANDLING PRECAUTIONS","6-15-2","731297/3",14586,"6-65-1","737041/3",14607,"6-115","748593/1",15091,"DELETE"]
[null,null,null,"HANDLING PRECAUTIONS","7-8","142611/1",20603,"7-58",142629,20604,"7-108","A80883","-","N-A03-□□",{"$f":"VLOOKUP(N198,'STICKER LIST'!$B$5:$F$33,2,FALSE)","v":"F39264"},{"$f":"VLOOKUP(N198,'STICKER LIST'!$B$5:$F$33,3,FALSE)","v":29813},{"$f":"VLOOKUP(N198,'STICKER LIST'!$B$5:$F$33,4,FALSE)","v":29814},{"$f":"VLOOKUP(N198,'STICKER LIST'!$B$5:$F$33,5,FALSE)","v":29815}]
[]
[]
["【MCHH-55/88】"]
[]
["MODEL","NAME PLATE ATTACHING DRAWING",null,"CONVENTIONAL",null,null,null,null,null,null,null,null,null,"NEW",null,null,null,null,"REFERENCE"]
["-","B11630",null,null,"Japanese",null,null,"English",null,null,"Chinese",null,null,null,null,"CORD(MJ)"]
[null,null,null,"NAME","NUMBER","DRAWING NUMBER(MJ)","CORD(MJ)","NUMBER","DRAWING NUMBER(MJ)","CORD(MJ)","NUMBER","DRAWING NUMBER(MJ)","CORD(MJ)","NUMBER","DRAWING NUMBER(MJ)","Japanese","English","Chinese"]
[null,null,null,"ELECTRIC SHOCK HAZARD","5-16-1","736249/1",14578,"5-66",737034,14600,"5-116","748601/1",15081,"Z-019-ZZ",{"$f":"VLOOKUP(N206,'STICKER LIST'!$B$5:$F$33,2,FALSE)","v":"F39248"},{"$f":"VLOOKUP(N206,'STICKER LIST'!$B$5:$F$33,3,FALSE)","v":29767},{"$f":"VLOOKUP(N206,'STICKER LIST'!$B$5:$F$33,4,FALSE)","v":"←"},{"$f":"VLOOKUP(N206,'STICKER LIST'!$B$5:$F$33,5,FALSE)","v":"←"}]
[null,null,null,"HOT SURFACE","5-31-2","736247/3",14583,"5-81","737038/2",14604,"5-131",748590,15088,"Z-029-ZZ",{"$f":"VLOOKUP(N207,'STICKER LIST'!$B$5:$F$33,2,FALSE)","v":"F39249"},{"$f":"VLOOKUP(N207,'STICKER LIST'!$B$5:$F$33,3,FALSE)","v":29771},{"$f":"VLOOKUP(N207,'STICKER LIST'!$B$5:$F$33,4,FALSE)","v":"←"},{"$f":"VLOOKUP(N207,'STICKER LIST'!$B$5:$F$33,5,FALSE)","v":"←"}]
[null,null,null,"HANDLING PRECAUTIONS","6-15-2","731297/3",14586,"6-65-1","737041/3",14607,"6-115","748593/1",15091,"DELETE"]
[null,null,null,"HANDLING PRECAUTIONS","7-8","142611/1",20603,"7-58",142629,20604,"7-108","A80883","-","N-A03-□□",{"$f":"VLOOKUP(N209,'STICKER LIST'!$B$5:$F$33,2,FALSE)","v":"F39264"},{"$f":"VLOOKUP(N209,'STICKER LIST'!$B$5:$F$33,3,FALSE)","v":29813},{"$f":"VLOOKUP(N209,'STICKER LIST'!$B$5:$F$33,4,FALSE)","v":29814},{"$f":"VLOOKUP(N209,'STICKER LIST'!$B$5:$F$33,5,FALSE)","v":29815}]
[]
[]
["【MC5-55/88/100HH】"]
[]
["MODEL","NAME PLATE ATTACHING DRAWING",null,"CONVENTIONAL",null,null,null,null,null,null,null,null,null,"NEW",null,null,null,null,"REFERENCE"]
[55,"D32549",null,null,"Japanese",null,null,"English",null,null,"Chinese",null,null,null,null,"CORD(MJ)"]
[88,"D32550",null,"NAME","NUMBER","DRAWING NUMBER(MJ)","CORD(MJ)","NUMBER","DRAWING NUMBER(MJ)","CORD(MJ)","NUMBER","DRAWING NUMBER(MJ)","CORD(MJ)","NUMBER","DRAWING NUMBER(MJ)","Japanese","English","Chinese"]
[100,"D32551",null,"ELECTRIC SHOCK HAZARD","3-31","731305/1",14591,"←",null,null,"←",null,null,"Z-019-ZZ",{"$f":"VLOOKUP(N217,'STICKER LIST'!$B$5:$F$33,2,FALSE)","v":"F39248"},{"$f":"VLOOKUP(N217,'STICKER LIST'!$B$5:$F$33,3,FALSE)","v":29767},{"$f":"VLOOKUP(N217,'STICKER LIST'!$B$5:$F$33,4,FALSE)","v":"←"},{"$f":"VLOOKUP(N217,'STICKER LIST'!$B$5:$F$33,5,FALSE)","v":"←"},"Used for G3"]
[null,null,null,"ELECTRIC SHOCK HAZARD","5-19","D09718",27398,"5-69","D09718",27399,"5-119","D10460",27404,"Z-019-ZZ",{"$f":"VLOOKUP(N218,'STICKER LIST'!$B$5:$F$33,2,FALSE)","v":"F39248"},{"$f":"VLOOKUP(N218,'STICKER LIST'!$B$5:$F$33,3,FALSE)","v":29767},{"$f":"VLOOKUP(N218,'STICKER LIST'!$B$5:$F$33,4,FALSE)","v":"←"},{"$f":"VLOOKUP(N218,'STICKER LIST'!$B$5:$F$33,5,FALSE)","v":"←"},"Used for G1"]
[null,null,null,"HOT SURFACE","5-33","D09719",27393,"5-83","D09719",27394,"5-133","D10461",27395,"Z-029-ZZ",{"$f":"VLOOKUP(N219,'STICKER LIST'!$B$5:$F$33,2,FALSE)","v":"F39249"},{"$f":"VLOOKUP(N219,'STICKER LIST'!$B$5:$F$33,3,FALSE)","v":29771},{"$f":"VLOOKUP(N219,'STICKER LIST'!$B$5:$F$33,4,FALSE)","v":"←"},{"$f":"VLOOKUP(N219,'STICKER LIST'!$B$5:$F$33,5,FALSE)","v":"←"}]
[null,null,null,"HANDLING PRECAUTIONS","6-16","D09721",27385,"6-66","D09721",27386,"6-116","D10463/1",27387,"DELETE"]
[null,null,null,"HANDLING PRECAUTIONS","7-10","D09720/1",27388,"7-60","D09720/1",27389,"7-110","D10462/3",27390,"N-A03-□□",{"$f":"VLOOKUP(N221,'STICKER LIST'!$B$5:$F$33,2,FALSE)","v":"F39264"},{"$f":"VLOOKUP(N221,'STICKER LIST'!$B$5:$F$33,3,FALSE)","v":29813},{"$f":"VLOOKUP(N221,'STICKER LIST'!$B$5:$F$33,4,FALSE)","v":29814},{"$f":"VLOOKUP(N221,'STICKER LIST'!$B$5:$F$33,5,FALSE)","v":29815}]
[]
[]
["【MC-5】"]
[]
["MODEL","NAME PLATE ATTACHING DRAWING",null,"CONVENTIONAL",null,null,null,null,null,null,null,null,null,"NEW",null,null,null,null,"REFERENCE"]
["-","A54573",null,null,"Japanese",null,null,"English",null,null,"Chinese",null,null,null,null,"CORD(MJ)"]
[null,null,null,"NAME","NUMBER","DRAWING NUMBER(MJ)","CORD(MJ)","NUMBER","DRAWING NUMBER(MJ)","CORD(MJ)","NUMBER","DRAWING NUMBER(MJ)","CORD(MJ)","NUMBER","DRAWING NUMBER(MJ)","Japanese","English","Chinese"]
[null,null,null,"ELECTRIC SHOCK HAZARD","‐",731305,"‐","‐","‐","‐","‐","‐","‐","Z-019-ZZ","F39248",29767,"←","←"]
[null,null,null,"ELECTRIC SHOCK HAZARD","5-18-1","736902/1",22128,"5-68","738372/1",14611,"5-118","748599/1",15083,"Z-019-ZZ",{"$f":"VLOOKUP(N230,'STICKER LIST'!$B$5:$F$33,2,FALSE)","v":"F39248"},{"$f":"VLOOKUP(N230,'STICKER LIST'!$B$5:$F$33,3,FALSE)","v":29767},{"$f":"VLOOKUP(N230,'STICKER LIST'!$B$5:$F$33,4,FALSE)","v":"←"},{"$f":"VLOOKUP(N230,'STICKER LIST'!$B$5:$F$33,5,FALSE)","v":"←"}]
[null,null,null,"HOT SURFACE","5-31-2","736247/3",14583,"5-81","737038/2",14604,"5-131",748590,15088,"Z-029-ZZ",{"$f":"VLOOKUP(N231,'STICKER LIST'!$B$5:$F$33,2,FALSE)","v":"F39249"},{"$f":"VLOOKUP(N231,'STICKER LIST'!$B$5:$F$33,3,FALSE)","v":29771},{"$f":"VLOOKUP(N231,'STICKER LIST'!$B$5:$F$33,4,FALSE)","v":"←"},{"$f":"VLOOKUP(N231,'STICKER LIST'!$B$5:$F$33,5,FALSE)","v":"←"}]
[null,null,null,"HANDLING PRECAUTIONS","6-15-2","731297/3",14586,"6-65-1","737041/3",14607,"6-115","748593/1",15091,"DELETE"]
[null,null,null,"HANDLING PRECAUTIONS","7-8","142611/1",20603,"7-58",142629,20604,"7-108","A80883","-","N-A03-□□",{"$f":"VLOOKUP(N233,'STICKER LIST'!$B$5:$F$33,2,FALSE)","v":"F39264"},{"$f":"VLOOKUP(N233,'STICKER LIST'!$B$5:$F$33,3,FALSE)","v":29813},{"$f":"VLOOKUP(N233,'STICKER LIST'!$B$5:$F$33,4,FALSE)","v":29814},{"$f":"VLOOKUP(N233,'STICKER LIST'!$B$5:$F$33,5,FALSE)","v":29815}]
[]
[]
["【MCM】"]
[]
["MODEL","全体図",null,"CONVENTIONAL",null,null,null,null,null,null,null,null,null,"NEW",null,null,null,null,"REFERENCE"]
["-","A21150",null,null,"Japanese",null,null,"English",null,null,"Chinese",null,null,null,null,"CORD(MJ)"]
[null,null,null,"NAME","NUMBER","DRAWING NUMBER(MJ)","CORD(MJ)","NUMBER","DRAWING NUMBER(MJ)","CORD(MJ)","NUMBER","DRAWING NUMBER(MJ)","CORD(MJ)","NUMBER","DRAWING NUMBER(MJ)","Japanese","English","Chinese"]
[null,null,null,"ELECTRIC SHOCK HAZARD","3-31","731305/1",14591,"←",null,null,"←",null,null,"Z-019-ZZ",{"$f":"VLOOKUP(N241,'STICKER LIST'!$B$5:$F$33,2,FALSE)","v":"F39248"},{"$f":"VLOOKUP(N241,'STICKER LIST'!$B$5:$F$33,3,FALSE)","v":29767},{"$f":"VLOOKUP(N241,'STICKER LIST'!$B$5:$F$33,4,FALSE)","v":"←"},{"$f":"VLOOKUP(N241,'STICKER LIST'!$B$5:$F$33,5,FALSE)","v":"←"}]
[null,null,null,"ELECTRIC SHOCK HAZARD","5-18-1","736902/1",22128,"5-68","738372/1",14611,"5-118","748599/1",15083,"Z-019-ZZ",{"$f":"VLOOKUP(N242,'STICKER LIST'!$B$5:$F$33,2,FALSE)","v":"F39248"},{"$f":"VLOOKUP(N242,'STICKER LIST'!$B$5:$F$33,3,FALSE)","v":29767},{"$f":"VLOOKUP(N242,'STICKER LIST'!$B$5:$F$33,4,FALSE)","v":"←"},{"$f":"VLOOKUP(N242,'STICKER LIST'!$B$5:$F$33,5,FALSE)","v":"←"}]
[null,null,null,"HOT SURFACE","5-11","736246/1",14577,"5-61","737033/1",14599,"5-111",748586,15079,"W-021-□□",{"$f":"VLOOKUP(N243,'STICKER LIST'!$B$5:$F$33,2,FALSE)","v":"F39192"},{"$f":"VLOOKUP(N243,'STICKER LIST'!$B$5:$F$33,3,FALSE)","v":29768},{"$f":"VLOOKUP(N243,'STICKER LIST'!$B$5:$F$33,4,FALSE)","v":29769},{"$f":"VLOOKUP(N243,'STICKER LIST'!$B$5:$F$33,5,FALSE)","v":29770}]
[null,null,null,"HOT SURFACE","5-31-2","736247/3",14583,"5-81","737038/2",14604,"5-131",748590,15088,"W-021-□□",{"$f":"VLOOKUP(N244,'STICKER LIST'!$B$5:$F$33,2,FALSE)","v":"F39192"},{"$f":"VLOOKUP(N244,'STICKER LIST'!$B$5:$F$33,3,FALSE)","v":29768},{"$f":"VLOOKUP(N244,'STICKER LIST'!$B$5:$F$33,4,FALSE)","v":29769},{"$f":"VLOOKUP(N244,'STICKER LIST'!$B$5:$F$33,5,FALSE)","v":29770}]
[null,null,null,"HOT SURFACE","5-32-1","736248/2",14584,"5-82","737039/2",14605,"5-132",748591,15089,"W-021-□□",{"$f":"VLOOKUP(N245,'STICKER LIST'!$B$5:$F$33,2,FALSE)","v":"F39192"},{"$f":"VLOOKUP(N245,'STICKER LIST'!$B$5:$F$33,3,FALSE)","v":29768},{"$f":"VLOOKUP(N245,'STICKER LIST'!$B$5:$F$33,4,FALSE)","v":29769},{"$f":"VLOOKUP(N245,'STICKER LIST'!$B$5:$F$33,5,FALSE)","v":29770}]
[null,null,null,"HANDLING PRECAUTIONS","6-15-2","731297/3",14586,"6-65-1","737041/3",14607,"6-115","748593/1",15091,"DELETE"]
[null,null,null,"HANDLING PRECAUTIONS","7-8","142611/1",20603,"7-58",142629,20604,"7-108","A80883","-","N-A03-□□",{"$f":"VLOOKUP(N247,'STICKER LIST'!$B$5:$F$33,2,FALSE)","v":"F39264"},{"$f":"VLOOKUP(N247,'STICKER LIST'!$B$5:$F$33,3,FALSE)","v":29813},{"$f":"VLOOKUP(N247,'STICKER LIST'!$B$5:$F$33,4,FALSE)","v":29814},{"$f":"VLOOKUP(N247,'STICKER LIST'!$B$5:$F$33,5,FALSE)","v":29815},"It is stated in the material request form and needs to be added to the name plate attaching drawing."]
[]
[]
["【MIC】"]
[]
["MODEL","NAME PLATE ATTACHING DRAWING",null,"CONVENTIONAL",null,null,null,null,null,null,null,null,null,"NEW",null,null,null,null,"REFERENCE"]
["-","A89116",null,null,"Japanese",null,null,"English",null,null,"Chinese",null,null,null,null,"CORD(MJ)"]
[null,null,null,"NAME","NUMBER","DRAWING NUMBER(MJ)","CORD(MJ)","NUMBER","DRAWING NUMBER(MJ)","CORD(MJ)","NUMBER","DRAWING NUMBER(MJ)","CORD(MJ)","NUMBER","DRAWING NUMBER(MJ)","Japanese","English","Chinese"]
[null,null,null,"ELECTRIC SHOCK HAZARD","3-31","731305/1",14591,"←",null,null,"←",null,null,"Z-019-ZZ",{"$f":"VLOOKUP(N255,'STICKER LIST'!$B$5:$F$33,2,FALSE)","v":"F39248"},{"$f":"VLOOKUP(N255,'STICKER LIST'!$B$5:$F$33,3,FALSE)","v":29767},{"$f":"VLOOKUP(N255,'STICKER LIST'!$B$5:$F$33,4,FALSE)","v":"←"},{"$f":"VLOOKUP(N255,'STICKER LIST'!$B$5:$F$33,5,FALSE)","v":"←"}]
[null,null,null,"ELECTRIC SHOCK HAZARD","5-18-1","736902/1",22128,"5-68","738372/1",14611,"5-118","748599/1",15083,"Z-019-ZZ",{"$f":"VLOOKUP(N256,'STICKER LIST'!$B$5:$F$33,2,FALSE)","v":"F39248"},{"$f":"VLOOKUP(N256,'STICKER LIST'!$B$5:$F$33,3,FALSE)","v":29767},{"$f":"VLOOKUP(N256,'STICKER LIST'!$B$5:$F$33,4,FALSE)","v":"←"},{"$f":"VLOOKUP(N256,'STICKER LIST'!$B$5:$F$33,5,FALSE)","v":"←"}]
[null,null,null,"ROTATING PARTS","5-22-1","731302/1",14580,"5-72","737036/1",14602,"5-122","748588/1",15085,"W-031-□□",{"$f":"VLOOKUP(N257,'STICKER LIST'!$B$5:$F$33,2,FALSE)","v":"F39250"},{"$f":"VLOOKUP(N257,'STICKER LIST'!$B$5:$F$33,3,FALSE)","v":29772},{"$f":"VLOOKUP(N257,'STICKER LIST'!$B$5:$F$33,4,FALSE)","v":29773},{"$f":"VLOOKUP(N257,'STICKER LIST'!$B$5:$F$33,5,FALSE)","v":29774}]
[null,null,null,"HANDLING PRECAUTIONS","6-15-2","731297/3",14586,"6-65-1","737041/3",14607,"6-115","748593/1",15091,"DELETE"]
[]
[]
["【MC5-200/350/450】"]
[]
["MODEL","NAME PLATE ATTACHING DRAWING",null,"CONVENTIONAL",null,null,null,null,null,null,null,null,null,"NEW",null,null,null,null,"REFERENCE"]
["-","D24374",null,null,"Japanese",null,null,"English",null,null,"Chinese",null,null,null,null,"CORD(MJ)"]
[null,null,null,"NAME","NUMBER","DRAWING NUMBER(MJ)","CORD(MJ)","NUMBER","DRAWING NUMBER(MJ)","CORD(MJ)","NUMBER","DRAWING NUMBER(MJ)","CORD(MJ)","NUMBER","DRAWING NUMBER(MJ)","Japanese","English","Chinese"]
[null,null,null,"ELECTRIC SHOCK HAZARD","3-31","731305/1",14591,"←",null,null,"←",null,null,"Z-019-ZZ",{"$f":"VLOOKUP(N266,'STICKER LIST'!$B$5:$F$33,2,FALSE)","v":"F39248"},{"$f":"VLOOKUP(N266,'STICKER LIST'!$B$5:$F$33,3,FALSE)","v":29767},{"$f":"VLOOKUP(N266,'STICKER LIST'!$B$5:$F$33,4,FALSE)","v":"←"},{"$f":"VLOOKUP(N266,'STICKER LIST'!$B$5:$F$33,5,FALSE)","v":"←"}]
[null,null,null,"HOT SURFACE","5-33","D09719",27393,"5-83","D09719",27394,"5-133","D10461",27395,"Z-029-ZZ",{"$f":"VLOOKUP(N267,'STICKER LIST'!$B$5:$F$33,2,FALSE)","v":"F39249"},{"$f":"VLOOKUP(N267,'STICKER LIST'!$B$5:$F$33,3,FALSE)","v":29771},{"$f":"VLOOKUP(N267,'STICKER LIST'!$B$5:$F$33,4,FALSE)","v":"←"},{"$f":"VLOOKUP(N267,'STICKER LIST'!$B$5:$F$33,5,FALSE)","v":"←"}]
[null,null,null,"HANDLING PRECAUTIONS","6-16","D09721",27385,"6-66","D09721",27386,"6-116","D10463/1",27387,"DELETE"]
[null,null,null,"HANDLING PRECAUTIONS","7-10","D09720/1",27388,"7-60","D09720/1",27389,"7-110","D10462/3",27390,"N-A03-□□",{"$f":"VLOOKUP(N269,'STICKER LIST'!$B$5:$F$33,2,FALSE)","v":"F39264"},{"$f":"VLOOKUP(N269,'STICKER LIST'!$B$5:$F$33,3,FALSE)","v":29813},{"$f":"VLOOKUP(N269,'STICKER LIST'!$B$5:$F$33,4,FALSE)","v":29814},{"$f":"VLOOKUP(N269,'STICKER LIST'!$B$5:$F$33,5,FALSE)","v":29815}]
[]
[]
["【MCLX/HX】"]
[]
["MODEL","NAME PLATE ATTACHING DRAWING",null,"CONVENTIONAL",null,null,null,null,null,null,null,null,null,"NEW",null,null,null,null,"REFERENCE"]
["-","A55945",null,null,"Japanese",null,null,"English",null,null,"Chinese",null,null,null,null,"CORD(MJ)"]
[null,null,null,"NAME","NUMBER","DRAWING NUMBER(MJ)","CORD(MJ)","NUMBER","DRAWING NUMBER(MJ)","CORD(MJ)","NUMBER","DRAWING NUMBER(MJ)","CORD(MJ)","NUMBER","DRAWING NUMBER(MJ)","Japanese","English","Chinese"]
[null,null,null,"ELECTRIC SHOCK HAZARD","5-16-1","736249/1",14578,"5-66",737034,14600,"5-116","748601/1",15081,"Z-019-ZZ",{"$f":"VLOOKUP(N277,'STICKER LIST'!$B$5:$F$33,2,FALSE)","v":"F39248"},{"$f":"VLOOKUP(N277,'STICKER LIST'!$B$5:$F$33,3,FALSE)","v":29767},{"$f":"VLOOKUP(N277,'STICKER LIST'!$B$5:$F$33,4,FALSE)","v":"←"},{"$f":"VLOOKUP(N277,'STICKER LIST'!$B$5:$F$33,5,FALSE)","v":"←"}]
[null,null,null,"HOT SURFACE","5-31-2","736247/3",14583,"5-81","737038/2",14604,"5-131",748590,15088,"Z-029-ZZ",{"$f":"VLOOKUP(N278,'STICKER LIST'!$B$5:$F$33,2,FALSE)","v":"F39249"},{"$f":"VLOOKUP(N278,'STICKER LIST'!$B$5:$F$33,3,FALSE)","v":29771},{"$f":"VLOOKUP(N278,'STICKER LIST'!$B$5:$F$33,4,FALSE)","v":"←"},{"$f":"VLOOKUP(N278,'STICKER LIST'!$B$5:$F$33,5,FALSE)","v":"←"}]
[null,null,null,"HANDLING PRECAUTIONS","6-15-2","731297/3",14586,"6-65-1","737041/3",14607,"6-115","748593/1",15091,"DELETE"]
[null,null,null,"HANDLING PRECAUTIONS","7-8","142611/1",20603,"7-58",142629,20604,"7-108","A80883","-","N-A03-□□",{"$f":"VLOOKUP(N280,'STICKER LIST'!$B$5:$F$33,2,FALSE)","v":"F39264"},{"$f":"VLOOKUP(N280,'STICKER LIST'!$B$5:$F$33,3,FALSE)","v":29813},{"$f":"VLOOKUP(N280,'STICKER LIST'!$B$5:$F$33,4,FALSE)","v":29814},{"$f":"VLOOKUP(N280,'STICKER LIST'!$B$5:$F$33,5,FALSE)","v":29815}]
[]
[]
["【MCAX】"]
[]
["MODEL","NAME PLATE ATTACHING DRAWING",null,"CONVENTIONAL",null,null,null,null,null,null,null,null,null,"NEW",null,null,null,null,"REFERENCE"]
[20,"B24457",null,null,"Japanese",null,null,"English",null,null,"Chinese",null,null,null,null,"CORD(MJ)"]
[50,"A51818",null,"NAME","NUMBER","DRAWING NUMBER(MJ)","CORD(MJ)","NUMBER","DRAWING NUMBER(MJ)","CORD(MJ)","NUMBER","DRAWING NUMBER(MJ)","CORD(MJ)","NUMBER","DRAWING NUMBER(MJ)","Japanese","English","Chinese"]
["140-400","A55948",null,"ELECTRIC SHOCK HAZARD","5-16-1","736249/1",14578,"5-66",737034,14600,"5-116","748601/1",15081,"Z-019-ZZ",{"$f":"VLOOKUP(N288,'STICKER LIST'!$B$5:$F$33,2,FALSE)","v":"F39248"},{"$f":"VLOOKUP(N288,'STICKER LIST'!$B$5:$F$33,3,FALSE)","v":29767},{"$f":"VLOOKUP(N288,'STICKER LIST'!$B$5:$F$33,4,FALSE)","v":"←"},{"$f":"VLOOKUP(N288,'STICKER LIST'!$B$5:$F$33,5,FALSE)","v":"←"}]
[null,null,null,"HOT SURFACE","5-31-2","736247/3",14583,"5-81","737038/2",14604,"5-131",748590,15088,"Z-029-ZZ",{"$f":"VLOOKUP(N289,'STICKER LIST'!$B$5:$F$33,2,FALSE)","v":"F39249"},{"$f":"VLOOKUP(N289,'STICKER LIST'!$B$5:$F$33,3,FALSE)","v":29771},{"$f":"VLOOKUP(N289,'STICKER LIST'!$B$5:$F$33,4,FALSE)","v":"←"},{"$f":"VLOOKUP(N289,'STICKER LIST'!$B$5:$F$33,5,FALSE)","v":"←"}]
[null,null,null,"HANDLING PRECAUTIONS","6-15-2","731297/3",14586,"6-65-1","737041/3",14607,"6-115","748593/1",15091,"DELETE"]
[null,null,null,"HANDLING PRECAUTIONS","7-8","142611/1",20603,"7-58",142629,20604,"7-108","A80883","-","N-A03-□□",{"$f":"VLOOKUP(N291,'STICKER LIST'!$B$5:$F$33,2,FALSE)","v":"F39264"},{"$f":"VLOOKUP(N291,'STICKER LIST'!$B$5:$F$33,3,FALSE)","v":29813},{"$f":"VLOOKUP(N291,'STICKER LIST'!$B$5:$F$33,4,FALSE)","v":29814},{"$f":"VLOOKUP(N291,'STICKER LIST'!$B$5:$F$33,5,FALSE)","v":29815}]
[]
[]
["【MCC5】"]
[]
["MODEL","NAME PLATE ATTACHING DRAWING",null,"CONVENTIONAL",null,null,null,null,null,null,null,null,null,"NEW",null,null,null,null,"REFERENCE"]
["03","B26678",null,null,"Japanese",null,null,"English",null,null,"Chinese",null,null,null,null,"CORD(MJ)"]
["05,08","B26679",null,"NAME","NUMBER","DRAWING NUMBER(MJ)","CORD(MJ)","NUMBER","DRAWING NUMBER(MJ)","CORD(MJ)","NUMBER","DRAWING NUMBER(MJ)","CORD(MJ)","NUMBER","DRAWING NUMBER(MJ)","Japanese","English","Chinese"]
[10,"B26680",null,"ELECTRIC SHOCK HAZARD","5-16-1","736249/1",14578,"5-66",737034,14600,"5-116","748601/1",15081,"Z-019-ZZ",{"$f":"VLOOKUP(N299,'STICKER LIST'!$B$5:$F$33,2,FALSE)","v":"F39248"},{"$f":"VLOOKUP(N299,'STICKER LIST'!$B$5:$F$33,3,FALSE)","v":29767},{"$f":"VLOOKUP(N299,'STICKER LIST'!$B$5:$F$33,4,FALSE)","v":"←"},{"$f":"VLOOKUP(N299,'STICKER LIST'!$B$5:$F$33,5,FALSE)","v":"←"}]
["15,20","B26681",null,"HANDLING PRECAUTIONS","6-15-2","731297/3",14586,"6-65-1","737041/3",14607,"6-115","748593/1",15091,"DELETE"]
[30,"B26682",null,"HANDLING PRECAUTIONS","7-3","739229/1",14598,"7-53",739228,14609,"7-103","748600/1",15094,"N-A04-□□",{"$f":"VLOOKUP(N301,'STICKER LIST'!$B$5:$F$33,2,FALSE)","v":"F39265"},{"$f":"VLOOKUP(N301,'STICKER LIST'!$B$5:$F$33,3,FALSE)","v":29816},{"$f":"VLOOKUP(N301,'STICKER LIST'!$B$5:$F$33,4,FALSE)","v":29817},{"$f":"VLOOKUP(N301,'STICKER LIST'!$B$5:$F$33,5,FALSE)","v":29818},"Used for more than 08. 05 and 08 use common name plate attachingdrawing.\nIt is necessary to add instructions to use it only in 08."]
[]
[]
["【MCC5-i】"]
[]
["MODEL","NAME PLATE ATTACHING DRAWING",null,"CONVENTIONAL",null,null,null,null,null,null,null,null,null,"NEW",null,null,null,null,"REFERENCE"]
["08,10","B25182",null,null,"Japanese",null,null,"English",null,null,"Chinese",null,null,null,null,"CORD(MJ)"]
["15,20","B26696",null,"NAME","NUMBER","DRAWING NUMBER(MJ)","CORD(MJ)","NUMBER","DRAWING NUMBER(MJ)","CORD(MJ)","NUMBER","DRAWING NUMBER(MJ)","CORD(MJ)","NUMBER","DRAWING NUMBER(MJ)","Japanese","English","Chinese"]
[null,null,null,"ELECTRIC SHOCK HAZARD","5-16-1","736249/1",14578,"5-66",737034,14600,"5-116","748601/1",15081,"Z-019-ZZ",{"$f":"VLOOKUP(N309,'STICKER LIST'!$B$5:$F$33,2,FALSE)","v":"F39248"},{"$f":"VLOOKUP(N309,'STICKER LIST'!$B$5:$F$33,3,FALSE)","v":29767},{"$f":"VLOOKUP(N309,'STICKER LIST'!$B$5:$F$33,4,FALSE)","v":"←"},{"$f":"VLOOKUP(N309,'STICKER LIST'!$B$5:$F$33,5,FALSE)","v":"←"}]
[null,null,null,"HANDLING PRECAUTIONS","6-15-2","731297/3",14586,"6-65-1","737041/3",14607,"6-115","748593/1",15091,"DELETE"]
[null,null,null,"HANDLING PRECAUTIONS","7-3","739229/1",14598,"7-53",739228,14609,"7-103","748600/1",15094,"N-A04-□□",{"$f":"VLOOKUP(N311,'STICKER LIST'!$B$5:$F$33,2,FALSE)","v":"F39265"},{"$f":"VLOOKUP(N311,'STICKER LIST'!$B$5:$F$33,3,FALSE)","v":29816},{"$f":"VLOOKUP(N311,'STICKER LIST'!$B$5:$F$33,4,FALSE)","v":29817},{"$f":"VLOOKUP(N311,'STICKER LIST'!$B$5:$F$33,5,FALSE)","v":29818}]
[]
[]
["【MCCA3】"]
[]
["MODEL","NAME PLATE ATTACHING DRAWING",null,"CONVENTIONAL",null,null,null,null,null,null,null,null,null,"NEW",null,null,null,null,"REFERENCE"]
[100,"A92081",null,null,"Japanese",null,null,"English",null,null,"Chinese",null,null,null,null,"CORD(MJ)"]
[200,"A92714",null,"NAME","NUMBER","DRAWING NUMBER(MJ)","CORD(MJ)","NUMBER","DRAWING NUMBER(MJ)","CORD(MJ)","NUMBER","DRAWING NUMBER(MJ)","CORD(MJ)","NUMBER","DRAWING NUMBER(MJ)","Japanese","English","Chinese"]
[300,"A92716"]
[]
[]
["【RAD/M】"]
[]
["MODEL","NAME PLATE ATTACHING DRAWING",null,"CONVENTIONAL",null,null,null,null,null,null,null,null,null,"NEW",null,null,null,null,"REFERENCE"]
[25,"A65363",null,null,"Japanese",null,null,"English",null,null,"Chinese",null,null,null,null,"CORD(MJ)"]
[40,"A65364",null,"NAME","NUMBER","DRAWING NUMBER(MJ)","CORD(MJ)","NUMBER","DRAWING NUMBER(MJ)","CORD(MJ)","NUMBER","DRAWING NUMBER(MJ)","CORD(MJ)","NUMBER","DRAWING NUMBER(MJ)","Japanese","English","Chinese"]
[80,"A65365",null,"ELECTRIC SHOCK HAZARD","5-16-1","736249/1",14578,"5-66",737034,14600,"5-116","748601/1",15081,"Z-019-ZZ",{"$f":"VLOOKUP(N327,'STICKER LIST'!$B$5:$F$33,2,FALSE)","v":"F39248"},{"$f":"VLOOKUP(N327,'STICKER LIST'!$B$5:$F$33,3,FALSE)","v":29767},{"$f":"VLOOKUP(N327,'STICKER LIST'!$B$5:$F$33,4,FALSE)","v":"←"},{"$f":"VLOOKUP(N327,'STICKER LIST'!$B$5:$F$33,5,FALSE)","v":"←"}]
[null,null,null,"HOT SURFACE","5-31-2","736247/3",14583,"5-81","737038/2",14604,"5-131",748590,15088,"W-021-□□",{"$f":"VLOOKUP(N328,'STICKER LIST'!$B$5:$F$33,2,FALSE)","v":"F39192"},{"$f":"VLOOKUP(N328,'STICKER LIST'!$B$5:$F$33,3,FALSE)","v":29768},{"$f":"VLOOKUP(N328,'STICKER LIST'!$B$5:$F$33,4,FALSE)","v":29769},{"$f":"VLOOKUP(N328,'STICKER LIST'!$B$5:$F$33,5,FALSE)","v":29770}]
[null,null,null,"ROTATING PARTS","-","A65304","-","-","-","-","-","-","-","W-031-□□",{"$f":"VLOOKUP(N329,'STICKER LIST'!$B$5:$F$33,2,FALSE)","v":"F39250"},{"$f":"VLOOKUP(N329,'STICKER LIST'!$B$5:$F$33,3,FALSE)","v":29772},{"$f":"VLOOKUP(N329,'STICKER LIST'!$B$5:$F$33,4,FALSE)","v":29773},{"$f":"VLOOKUP(N329,'STICKER LIST'!$B$5:$F$33,5,FALSE)","v":29774}]
[null,null,null,"HANDLING PRECAUTIONS","6-15-2","731297/3",14586,"6-65-1","737041/3",14607,"6-115","748593/1",15091,"DELETE"]
[null,null,null,"HANDLING PRECAUTIONS","7-3","739229/1",14598,"7-53",739228,14609,"7-103","748600/1",15094,"N-A04-□□",{"$f":"VLOOKUP(N331,'STICKER LIST'!$B$5:$F$33,2,FALSE)","v":"F39265"},{"$f":"VLOOKUP(N331,'STICKER LIST'!$B$5:$F$33,3,FALSE)","v":29816},{"$f":"VLOOKUP(N331,'STICKER LIST'!$B$5:$F$33,4,FALSE)","v":29817},{"$f":"VLOOKUP(N331,'STICKER LIST'!$B$5:$F$33,5,FALSE)","v":29818}]
[]
[]
["【MCX】"]
[]
["MODEL","NAME PLATE ATTACHING DRAWING",null,"CONVENTIONAL",null,null,null,null,null,null,null,null,null,"NEW",null,null,null,null,"REFERENCE"]
["-",773174,null,null,"Japanese",null,null,"English",null,null,"Chinese",null,null,null,null,"CORD(MJ)"]
[null,null,null,"NAME","NUMBER","DRAWING NUMBER(MJ)","CORD(MJ)","NUMBER","DRAWING NUMBER(MJ)","CORD(MJ)","NUMBER","DRAWING NUMBER(MJ)","CORD(MJ)","NUMBER","DRAWING NUMBER(MJ)","Japanese","English","Chinese"]
[null,null,null,"ELECTRIC SHOCK HAZARD","5-16-1","736249/1",14578,"5-66",737034,14600,"5-116","748601/1",15081,"Z-019-ZZ",{"$f":"VLOOKUP(N339,'STICKER LIST'!$B$5:$F$33,2,FALSE)","v":"F39248"},{"$f":"VLOOKUP(N339,'STICKER LIST'!$B$5:$F$33,3,FALSE)","v":29767},{"$f":"VLOOKUP(N339,'STICKER LIST'!$B$5:$F$33,4,FALSE)","v":"←"},{"$f":"VLOOKUP(N339,'STICKER LIST'!$B$5:$F$33,5,FALSE)","v":"←"}]
[null,null,null,"HOT SURFACE","5-31-2","736247/3",14583,"5-81","737038/2",14604,"5-131",748590,15088,"W-021-□□",{"$f":"VLOOKUP(N340,'STICKER LIST'!$B$5:$F$33,2,FALSE)","v":"F39192"},{"$f":"VLOOKUP(N340,'STICKER LIST'!$B$5:$F$33,3,FALSE)","v":29768},{"$f":"VLOOKUP(N340,'STICKER LIST'!$B$5:$F$33,4,FALSE)","v":29769},{"$f":"VLOOKUP(N340,'STICKER LIST'!$B$5:$F$33,5,FALSE)","v":29770}]
[null,null,null,"HANDLING PRECAUTIONS","6-15-2","731297/3",14586,"6-65-1","737041/3",14607,"6-115","748593/1",15091,"DELETE"]
[null,null,null,"HANDLING PRECAUTIONS","7-3","739229/1",14598,"7-53",739228,14609,"7-103","748600/1",15094,"N-A04-□□",{"$f":"VLOOKUP(N342,'STICKER LIST'!$B$5:$F$33,2,FALSE)","v":"F39265"},{"$f":"VLOOKUP(N342,'STICKER LIST'!$B$5:$F$33,3,FALSE)","v":29816},{"$f":"VLOOKUP(N342,'STICKER LIST'!$B$5:$F$33,4,FALSE)","v":29817},{"$f":"VLOOKUP(N342,'STICKER LIST'!$B$5:$F$33,5,FALSE)","v":29818}]
[null,null,null,"HANDLING PRECAUTIONS","7-8","142611/1",20603,"7-58",142629,20604,"7-108","A80883","-","N-A03-□□",{"$f":"VLOOKUP(N343,'STICKER LIST'!$B$5:$F$33,2,FALSE)","v":"F39264"},{"$f":"VLOOKUP(N343,'STICKER LIST'!$B$5:$F$33,3,FALSE)","v":29813},{"$f":"VLOOKUP(N343,'STICKER LIST'!$B$5:$F$33,4,FALSE)","v":29814},{"$f":"VLOOKUP(N343,'STICKER LIST'!$B$5:$F$33,5,FALSE)","v":29815}]
[]
[]
["【T】"]
[]
["MODEL","NAME PLATE ATTACHING DRAWING",null,"CONVENTIONAL",null,null,null,null,null,null,null,null,null,"NEW",null,null,null,null,"REFERENCE"]
["-","A64108",null,null,"Japanese",null,null,"English",null,null,"Chinese",null,null,null,null,"CORD(MJ)"]
[null,null,null,"NAME","NUMBER","DRAWING NUMBER(MJ)","CORD(MJ)","NUMBER","DRAWING NUMBER(MJ)","CORD(MJ)","NUMBER","DRAWING NUMBER(MJ)","CORD(MJ)","NUMBER","DRAWING NUMBER(MJ)","Japanese","English","Chinese"]
[null,null,null,"ELECTRIC SHOCK HAZARD","5-18-1","736902/1",22128,"5-68","738372/1",14611,"5-118","748599/1",15083,"Z-019-ZZ",{"$f":"VLOOKUP(N351,'STICKER LIST'!$B$5:$F$33,2,FALSE)","v":"F39248"},{"$f":"VLOOKUP(N351,'STICKER LIST'!$B$5:$F$33,3,FALSE)","v":29767},{"$f":"VLOOKUP(N351,'STICKER LIST'!$B$5:$F$33,4,FALSE)","v":"←"},{"$f":"VLOOKUP(N351,'STICKER LIST'!$B$5:$F$33,5,FALSE)","v":"←"},"There is a description in the warning light BOX drawing."]
[]
[]
["【JCGB】"]
[]
["MODEL","NAME PLATE ATTACHING DRAWING",null,"CONVENTIONAL",null,null,null,null,null,null,null,null,null,"NEW",null,null,null,null,"REFERENCE"]
["-","SB00F12863",null,null,"Japanese",null,null,"English",null,null,"Chinese",null,null,null,null,"CORD(MJ)"]
[null,null,null,"NAME","NUMBER","DRAWING NUMBER(MJ)","CORD(MJ)","NUMBER","DRAWING NUMBER(MJ)","CORD(MJ)","NUMBER","DRAWING NUMBER(MJ)","CORD(MJ)","NUMBER","DRAWING NUMBER(MJ)","Japanese","English","Chinese"]
[null,null,null,"ELECTRIC SHOCK HAZARD","3-31","731305/1",14591,"←",null,null,"←",null,null,"Z-019-ZZ",{"$f":"VLOOKUP(N359,'STICKER LIST'!$B$5:$F$33,2,FALSE)","v":"F39248"},{"$f":"VLOOKUP(N359,'STICKER LIST'!$B$5:$F$33,3,FALSE)","v":29767},{"$f":"VLOOKUP(N359,'STICKER LIST'!$B$5:$F$33,4,FALSE)","v":"←"},{"$f":"VLOOKUP(N359,'STICKER LIST'!$B$5:$F$33,5,FALSE)","v":"←"}]
[null,null,null,"ROTATING PARTS, MOVING PARTS, OPEN/CLOSE PRECAUTIONS","5-29",736244,14582,"5-79","737037/1",14603,"5-129","748589/1",15087,"W-041-□□",{"$f":"VLOOKUP(N360,'STICKER LIST'!$B$5:$F$33,2,FALSE)","v":"F39253"},{"$f":"VLOOKUP(N360,'STICKER LIST'!$B$5:$F$33,3,FALSE)","v":29779},{"$f":"VLOOKUP(N360,'STICKER LIST'!$B$5:$F$33,4,FALSE)","v":29780},{"$f":"VLOOKUP(N360,'STICKER LIST'!$B$5:$F$33,5,FALSE)","v":29781},"Used for the hopper.Drawings are written using numbers (SMC)."]
[null,null,null,"ROTATING PARTS, MOVING PARTS, OPEN/CLOSE PRECAUTIONS","5-29",736244,14582,"5-79","737037/1",14603,"5-129","748589/1",15087,"W-031-□□",{"$f":"VLOOKUP(N361,'STICKER LIST'!$B$5:$F$33,2,FALSE)","v":"F39250"},{"$f":"VLOOKUP(N361,'STICKER LIST'!$B$5:$F$33,3,FALSE)","v":29772},{"$f":"VLOOKUP(N361,'STICKER LIST'!$B$5:$F$33,4,FALSE)","v":29773},{"$f":"VLOOKUP(N361,'STICKER LIST'!$B$5:$F$33,5,FALSE)","v":29774},"Used for the front panel. Drawings are written using numbers (SMC)."]
[]
[]
["【JC3】"]
[]
["MODEL","全体図",null,"CONVENTIONAL",null,null,null,null,null,null,null,null,null,"NEW",null,null,null,null,"REFERENCE"]
[102,"B28350",null,null,"Japanese",null,null,"English",null,null,"Chinese",null,null,null,null,"CORD(MJ)"]
[103,"B28353",null,"NAME","NUMBER","DRAWING NUMBER(MJ)","CORD(MJ)","NUMBER","DRAWING NUMBER(MJ)","CORD(MJ)","NUMBER","DRAWING NUMBER(MJ)","CORD(MJ)","NUMBER","DRAWING NUMBER(MJ)","Japanese","English","Chinese"]
[104,"B13815",null,"ELECTRIC SHOCK HAZARD","3-31","731305/1",14591,"←",null,null,"←",null,null,"Z-019-ZZ",{"$f":"VLOOKUP(N369,'STICKER LIST'!$B$5:$F$33,2,FALSE)","v":"F39248"},{"$f":"VLOOKUP(N369,'STICKER LIST'!$B$5:$F$33,3,FALSE)","v":29767},{"$f":"VLOOKUP(N369,'STICKER LIST'!$B$5:$F$33,4,FALSE)","v":"←"},{"$f":"VLOOKUP(N369,'STICKER LIST'!$B$5:$F$33,5,FALSE)","v":"←"}]
[null,null,null,"ELECTRIC SHOCK HAZARD","5-18-1","736902/1",22128,"5-68","738372/1",14611,"5-118","748599/1",15083,"Z-019-ZZ",{"$f":"VLOOKUP(N370,'STICKER LIST'!$B$5:$F$33,2,FALSE)","v":"F39248"},{"$f":"VLOOKUP(N370,'STICKER LIST'!$B$5:$F$33,3,FALSE)","v":29767},{"$f":"VLOOKUP(N370,'STICKER LIST'!$B$5:$F$33,4,FALSE)","v":"←"},{"$f":"VLOOKUP(N370,'STICKER LIST'!$B$5:$F$33,5,FALSE)","v":"←"}]
[null,null,null,"ROTATING PARTS","5-22-1","731302/1",14580,"5-72","737036/1",14602,"5-122","748588/1",15085,"W-031-□□",{"$f":"VLOOKUP(N371,'STICKER LIST'!$B$5:$F$33,2,FALSE)","v":"F39250"},{"$f":"VLOOKUP(N371,'STICKER LIST'!$B$5:$F$33,3,FALSE)","v":29772},{"$f":"VLOOKUP(N371,'STICKER LIST'!$B$5:$F$33,4,FALSE)","v":29773},{"$f":"VLOOKUP(N371,'STICKER LIST'!$B$5:$F$33,5,FALSE)","v":29774}]
[null,null,null,"TOPPLING HAZARD","5-44",149480,18890,"5-94",149816,19535,"5-144",177977,19535,"W-071-□□",{"$f":"VLOOKUP(N372,'STICKER LIST'!$B$5:$F$33,2,FALSE)","v":"F39257"},{"$f":"VLOOKUP(N372,'STICKER LIST'!$B$5:$F$33,3,FALSE)","v":29791},{"$f":"VLOOKUP(N372,'STICKER LIST'!$B$5:$F$33,4,FALSE)","v":29792},{"$f":"VLOOKUP(N372,'STICKER LIST'!$B$5:$F$33,5,FALSE)","v":29793}]
[]
[]
["【JCLW】","※Purchased item"]
[]
["MODEL","NAME PLATE ATTACHING DRAWING",null,"CONVENTIONAL",null,null,null,null,null,null,null,null,null,"NEW",null,null,null,null,"REFERENCE"]
["-","-",null,null,"Japanese",null,null,"English",null,null,"Chinese",null,null,null,null,"CORD(MJ)"]
[null,null,null,"NAME","NUMBER","DRAWING NUMBER(MJ)","CORD(MJ)","NUMBER","DRAWING NUMBER(MJ)","CORD(MJ)","NUMBER","DRAWING NUMBER(MJ)","CORD(MJ)","NUMBER","DRAWING NUMBER(MJ)","Japanese","English","Chinese"]
[]
[]
[]
["【JCW2-i】"]
[]
["MODEL","NAME PLATE ATTACHING DRAWING",null,"CONVENTIONAL",null,null,null,null,null,null,null,null,null,"NEW",null,null,null,null,"REFERENCE"]
["-","F02732",null,null,"Japanese",null,null,"English",null,null,"Chinese",null,null,null,null,"CORD(MJ)"]
[null,null,null,"NAME","NUMBER","DRAWING NUMBER(MJ)","CORD(MJ)","NUMBER","DRAWING NUMBER(MJ)","CORD(MJ)","NUMBER","DRAWING NUMBER(MJ)","CORD(MJ)","NUMBER","DRAWING NUMBER(MJ)","Japanese","English","Chinese"]
[null,null,null,"ELECTRIC SHOCK HAZARD","5-18-1","736902/1",22128,"5-68","738372/1",14611,"5-118","748599/1",15083,"Z-019-ZZ",{"$f":"VLOOKUP(N388,'STICKER LIST'!$B$5:$F$33,2,FALSE)","v":"F39248"},{"$f":"VLOOKUP(N388,'STICKER LIST'!$B$5:$F$33,3,FALSE)","v":29767},{"$f":"VLOOKUP(N388,'STICKER LIST'!$B$5:$F$33,4,FALSE)","v":"←"},{"$f":"VLOOKUP(N388,'STICKER LIST'!$B$5:$F$33,5,FALSE)","v":"←"}]
[null,null,null,"ROTATING PARTS","5-22-1","731302/1",14580,"5-72","737036/1",14602,"5-122","748588/1",15085,"W-031-□□",{"$f":"VLOOKUP(N389,'STICKER LIST'!$B$5:$F$33,2,FALSE)","v":"F39250"},{"$f":"VLOOKUP(N389,'STICKER LIST'!$B$5:$F$33,3,FALSE)","v":29772},{"$f":"VLOOKUP(N389,'STICKER LIST'!$B$5:$F$33,4,FALSE)","v":29773},{"$f":"VLOOKUP(N389,'STICKER LIST'!$B$5:$F$33,5,FALSE)","v":29774}]
[null,null,null,"HANDLING PRECAUTIONS","6-15-2","731297/3",14586,"6-65-1","737041/3",14607,"6-115","748593/1",15091,"DELETE"]
[]
[]
["【JCW2】"]
[]
["MODEL","NAME PLATE ATTACHING DRAWING",null,"CONVENTIONAL",null,null,null,null,null,null,null,null,null,"NEW",null,null,null,null,"REFERENCE"]
[10,"A47205",null,null,"Japanese",null,null,"English",null,null,"Chinese",null,null,null,null,"CORD(MJ)"]
[20,"A50713",null,"NAME","NUMBER","DRAWING NUMBER(MJ)","CORD(MJ)","NUMBER","DRAWING NUMBER(MJ)","CORD(MJ)","NUMBER","DRAWING NUMBER(MJ)","CORD(MJ)","NUMBER","DRAWING NUMBER(MJ)","Japanese","English","Chinese"]
[30,"-",null,"ELECTRIC SHOCK HAZARD","3-31","731305/1",14591,"←",null,null,"←",null,null,"Z-019-ZZ",{"$f":"VLOOKUP(N398,'STICKER LIST'!$B$5:$F$33,2,FALSE)","v":"F39248"},{"$f":"VLOOKUP(N398,'STICKER LIST'!$B$5:$F$33,3,FALSE)","v":29767},{"$f":"VLOOKUP(N398,'STICKER LIST'!$B$5:$F$33,4,FALSE)","v":"←"},{"$f":"VLOOKUP(N398,'STICKER LIST'!$B$5:$F$33,5,FALSE)","v":"←"}]
[60,"-",null,"ELECTRIC SHOCK HAZARD","5-18-1","736902/1",22128,"5-68","738372/1",14611,"5-118","748599/1",15083,"Z-019-ZZ",{"$f":"VLOOKUP(N399,'STICKER LIST'!$B$5:$F$33,2,FALSE)","v":"F39248"},{"$f":"VLOOKUP(N399,'STICKER LIST'!$B$5:$F$33,3,FALSE)","v":29767},{"$f":"VLOOKUP(N399,'STICKER LIST'!$B$5:$F$33,4,FALSE)","v":"←"},{"$f":"VLOOKUP(N399,'STICKER LIST'!$B$5:$F$33,5,FALSE)","v":"←"}]
[90,"-",null,"HOT SURFACE","5-32-1","736248/2",14584,"5-82","737039/2",14605,"5-132",748591,15089,"Z-029-ZZ",{"$f":"VLOOKUP(N400,'STICKER LIST'!$B$5:$F$33,2,FALSE)","v":"F39249"},{"$f":"VLOOKUP(N400,'STICKER LIST'!$B$5:$F$33,3,FALSE)","v":29771},{"$f":"VLOOKUP(N400,'STICKER LIST'!$B$5:$F$33,4,FALSE)","v":"←"},{"$f":"VLOOKUP(N400,'STICKER LIST'!$B$5:$F$33,5,FALSE)","v":"←"},"Used for SF"]
[null,null,null,"ROTATING PARTS","5-22-1","731302/1",14580,"5-72","737036/1",14602,"5-122","748588/1",15085,"W-031-□□",{"$f":"VLOOKUP(N401,'STICKER LIST'!$B$5:$F$33,2,FALSE)","v":"F39250"},{"$f":"VLOOKUP(N401,'STICKER LIST'!$B$5:$F$33,3,FALSE)","v":29772},{"$f":"VLOOKUP(N401,'STICKER LIST'!$B$5:$F$33,4,FALSE)","v":29773},{"$f":"VLOOKUP(N401,'STICKER LIST'!$B$5:$F$33,5,FALSE)","v":29774},"Used for SF"]
[null,null,null,"MOVING PARTS","6-21-1","731303/2",14587,"6-71","737042/2",14608,"6-121","748594/1",15093,"W-041-□□",{"$f":"VLOOKUP(N402,'STICKER LIST'!$B$5:$F$33,2,FALSE)","v":"F39253"},{"$f":"VLOOKUP(N402,'STICKER LIST'!$B$5:$F$33,3,FALSE)","v":29779},{"$f":"VLOOKUP(N402,'STICKER LIST'!$B$5:$F$33,4,FALSE)","v":29780},{"$f":"VLOOKUP(N402,'STICKER LIST'!$B$5:$F$33,5,FALSE)","v":29781}]
[null,null,null,"HANDLING PRECAUTIONS","6-15-2","731297/3",14586,"6-65-1","737041/3",14607,"6-115","748593/1",15091,"DELETE"]
[]
[]
["【JCT】"]
[]
["MODEL","NAME PLATE ATTACHING DRAWING",null,"CONVENTIONAL",null,null,null,null,null,null,null,null,null,"NEW",null,null,null,null,"REFERENCE"]
["SS","A50617",null,null,"Japanese",null,null,"English",null,null,"Chinese",null,null,null,null,"CORD(MJ)"]
[null,null,null,"NAME","NUMBER","DRAWING NUMBER(MJ)","CORD(MJ)","NUMBER","DRAWING NUMBER(MJ)","CORD(MJ)","NUMBER","DRAWING NUMBER(MJ)","CORD(MJ)","NUMBER","DRAWING NUMBER(MJ)","Japanese","English","Chinese"]
[null,null,null,"ELECTRIC SHOCK HAZARD","5-18-1","736902/1",22128,"5-68","738372/1",14611,"5-118","748599/1",15083,"Z-019-ZZ",{"$f":"VLOOKUP(N411,'STICKER LIST'!$B$5:$F$33,2,FALSE)","v":"F39248"},{"$f":"VLOOKUP(N411,'STICKER LIST'!$B$5:$F$33,3,FALSE)","v":29767},{"$f":"VLOOKUP(N411,'STICKER LIST'!$B$5:$F$33,4,FALSE)","v":"←"},{"$f":"VLOOKUP(N411,'STICKER LIST'!$B$5:$F$33,5,FALSE)","v":"←"}]
[null,null,null,"ROTATING PARTS","5-22-1","731302/1",14580,"5-72","737036/1",14602,"5-122","748588/1",15085,"W-031-□□",{"$f":"VLOOKUP(N412,'STICKER LIST'!$B$5:$F$33,2,FALSE)","v":"F39250"},{"$f":"VLOOKUP(N412,'STICKER LIST'!$B$5:$F$33,3,FALSE)","v":29772},{"$f":"VLOOKUP(N412,'STICKER LIST'!$B$5:$F$33,4,FALSE)","v":29773},{"$f":"VLOOKUP(N412,'STICKER LIST'!$B$5:$F$33,5,FALSE)","v":29774}]
[]
[]
["【JSV】"]
[]
["MODEL","全体図",null,"CONVENTIONAL",null,null,null,null,null,null,null,null,null,"NEW",null,null,null,null,"REFERENCE"]
["-",724653,null,null,"Japanese",null,null,"English",null,null,"Chinese",null,null,null,null,"CORD(MJ)"]
[null,null,null,"NAME","NUMBER","DRAWING NUMBER(MJ)","CORD(MJ)","NUMBER","DRAWING NUMBER(MJ)","CORD(MJ)","NUMBER","DRAWING NUMBER(MJ)","CORD(MJ)","NUMBER","DRAWING NUMBER(MJ)","Japanese","English","Chinese"]
[null,null,null,"ELECTRIC SHOCK HAZARD","3-31","731305/1",14591,"←",null,null,"←",null,null,"Z-019-ZZ",{"$f":"VLOOKUP(N420,'STICKER LIST'!$B$5:$F$33,2,FALSE)","v":"F39248"},{"$f":"VLOOKUP(N420,'STICKER LIST'!$B$5:$F$33,3,FALSE)","v":29767},{"$f":"VLOOKUP(N420,'STICKER LIST'!$B$5:$F$33,4,FALSE)","v":"←"},{"$f":"VLOOKUP(N420,'STICKER LIST'!$B$5:$F$33,5,FALSE)","v":"←"}]
[null,null,null,"※\"MOVING PARTS\" is not applicable because it is an aluminum nameplate."]
[]
[]
["【SMGL3】"]
[]
["MODEL","NAME PLATE ATTACHING DRAWING",null,"CONVENTIONAL",null,null,null,null,null,null,null,null,null,"NEW",null,null,null,null,"REFERENCE"]
["-","SB01121008",null,null,"Japanese",null,null,"English",null,null,"Chinese",null,null,null,null,"CORD(MJ)"]
[null,null,null,"NAME","NUMBER","DRAWING NUMBER(MJ)","CORD(MJ)","NUMBER","DRAWING NUMBER(MJ)","CORD(MJ)","NUMBER","DRAWING NUMBER(MJ)","CORD(MJ)","NUMBER","DRAWING NUMBER(MJ)","Japanese","English","Chinese"]
[null,null,null,"ELECTRIC SHOCK HAZARD","5-18-1","736902/1",22128,"5-68","738372/1",14611,"5-118","748599/1",15083,"Z-019-ZZ",{"$f":"VLOOKUP(N429,'STICKER LIST'!$B$5:$F$33,2,FALSE)","v":"F39248"},{"$f":"VLOOKUP(N429,'STICKER LIST'!$B$5:$F$33,3,FALSE)","v":29767},{"$f":"VLOOKUP(N429,'STICKER LIST'!$B$5:$F$33,4,FALSE)","v":"←"},{"$f":"VLOOKUP(N429,'STICKER LIST'!$B$5:$F$33,5,FALSE)","v":"←"}]
[null,null,null,"ROTATING PARTS","4-11",149478,18888,"4-61",149814,19534,"4-111",177974,"-","W-031-□□",{"$f":"VLOOKUP(N430,'STICKER LIST'!$B$5:$F$33,2,FALSE)","v":"F39250"},{"$f":"VLOOKUP(N430,'STICKER LIST'!$B$5:$F$33,3,FALSE)","v":29772},{"$f":"VLOOKUP(N430,'STICKER LIST'!$B$5:$F$33,4,FALSE)","v":29773},{"$f":"VLOOKUP(N430,'STICKER LIST'!$B$5:$F$33,5,FALSE)","v":29774}]
[null,null,null,"ROTATING PARTS","4-12",149479,18889,"4-62",149815,19537,"4-112",177975,"-","W-031-□□",{"$f":"VLOOKUP(N431,'STICKER LIST'!$B$5:$F$33,2,FALSE)","v":"F39250"},{"$f":"VLOOKUP(N431,'STICKER LIST'!$B$5:$F$33,3,FALSE)","v":29772},{"$f":"VLOOKUP(N431,'STICKER LIST'!$B$5:$F$33,4,FALSE)","v":29773},{"$f":"VLOOKUP(N431,'STICKER LIST'!$B$5:$F$33,5,FALSE)","v":29774}]
[null,null,null,"ROTATING PARTS","5-22-1","731302/1",14580,"5-72","737036/1",14602,"5-122","748588/1",15085,"W-031-□□",{"$f":"VLOOKUP(N432,'STICKER LIST'!$B$5:$F$33,2,FALSE)","v":"F39250"},{"$f":"VLOOKUP(N432,'STICKER LIST'!$B$5:$F$33,3,FALSE)","v":29772},{"$f":"VLOOKUP(N432,'STICKER LIST'!$B$5:$F$33,4,FALSE)","v":29773},{"$f":"VLOOKUP(N432,'STICKER LIST'!$B$5:$F$33,5,FALSE)","v":29774}]
[null,null,null,"PINCH POINT","5-45",149481,18891,"5-95",149818,19530,"5-145",177979,"-","W-051-□□",{"$f":"VLOOKUP(N433,'STICKER LIST'!$B$5:$F$33,2,FALSE)","v":"F39254"},{"$f":"VLOOKUP(N433,'STICKER LIST'!$B$5:$F$33,3,FALSE)","v":29782},{"$f":"VLOOKUP(N433,'STICKER LIST'!$B$5:$F$33,4,FALSE)","v":29783},{"$f":"VLOOKUP(N433,'STICKER LIST'!$B$5:$F$33,5,FALSE)","v":29784}]
[null,null,null,"PINCH POINT","5-54","A15355",22235,"5-104","A25895","-","-","-","-","W-051-□□",{"$f":"VLOOKUP(N434,'STICKER LIST'!$B$5:$F$33,2,FALSE)","v":"F39254"},{"$f":"VLOOKUP(N434,'STICKER LIST'!$B$5:$F$33,3,FALSE)","v":29782},{"$f":"VLOOKUP(N434,'STICKER LIST'!$B$5:$F$33,4,FALSE)","v":29783},{"$f":"VLOOKUP(N434,'STICKER LIST'!$B$5:$F$33,5,FALSE)","v":29784},"The Chinese number of name plate attaching drawing is SMC number."]
[null,null,null,"TOPPLING HAZARD","4-10",149477,18887,"4-60",149813,19536,"4-110",177973,"-","D-072-□□",{"$f":"VLOOKUP(N435,'STICKER LIST'!$B$5:$F$33,2,FALSE)","v":"F39258"},{"$f":"VLOOKUP(N435,'STICKER LIST'!$B$5:$F$33,3,FALSE)","v":29794},{"$f":"VLOOKUP(N435,'STICKER LIST'!$B$5:$F$33,4,FALSE)","v":29795},{"$f":"VLOOKUP(N435,'STICKER LIST'!$B$5:$F$33,5,FALSE)","v":29796}]
[null,null,null,"SHARP POINTS","5-47",149483,18893,"5-97",149820,19531,"5-147",177982,"-","Z-089-ZZ",{"$f":"VLOOKUP(N436,'STICKER LIST'!$B$5:$F$33,2,FALSE)","v":"F39259"},{"$f":"VLOOKUP(N436,'STICKER LIST'!$B$5:$F$33,3,FALSE)","v":29797},{"$f":"VLOOKUP(N436,'STICKER LIST'!$B$5:$F$33,4,FALSE)","v":"←"},{"$f":"VLOOKUP(N436,'STICKER LIST'!$B$5:$F$33,5,FALSE)","v":"←"}]
[null,null,null,"FLYING DEBRIS","4-13",149594,18898,"4-63",149828,19538,"4-113",177976,"-","W-091-□□",{"$f":"VLOOKUP(N437,'STICKER LIST'!$B$5:$F$33,2,FALSE)","v":"F39260"},{"$f":"VLOOKUP(N437,'STICKER LIST'!$B$5:$F$33,3,FALSE)","v":29798},{"$f":"VLOOKUP(N437,'STICKER LIST'!$B$5:$F$33,4,FALSE)","v":29799},{"$f":"VLOOKUP(N437,'STICKER LIST'!$B$5:$F$33,5,FALSE)","v":29800}]
[null,null,null,"CAUTION FOR MALFUNCTION","5-48",149484,18894,"5-98",149823,19532,"5-148",177983,"-","N-A01-□□",{"$f":"VLOOKUP(N438,'STICKER LIST'!$B$5:$F$33,2,FALSE)","v":"F39240"},{"$f":"VLOOKUP(N438,'STICKER LIST'!$B$5:$F$33,3,FALSE)","v":29745},{"$f":"VLOOKUP(N438,'STICKER LIST'!$B$5:$F$33,4,FALSE)","v":29807},{"$f":"VLOOKUP(N438,'STICKER LIST'!$B$5:$F$33,5,FALSE)","v":29808}]
[null,null,null,"HANDLING PRECAUTIONS","5-49","149574/2",18897,"5-99-1","149827/1",17539,"5-149",177984,"-","DELETE",null,null,null,null,"Write details in the instruction manual. \"-7\" in name plate attaching drawing is a clerical error of  \"-5\"."]
[null,null,null,"CAUTION","6-26","149485/2",18895,"6-76",149824,19533,"6-126",177985,"-","DELETE",null,null,null,null,"Write details in the instruction manual. The Chinese number of name plate attaching drawing is SMC number."]
[null,null,null,"HANDLING PRECAUTIONS","7-9","149486/1",18896,"7-59-1","149825/1",19529,"7-109",177986,"-","DELETE",null,null,null,null,"Write details in the instruction manual."]
[null,null,null,"DO NOT REMOVE THE LIMIT SWITCH","5-50",185700,21904,"5-100","186575/1","-","-","-","-","DELETE",null,null,null,null,"Write details in the instruction manual. The Chinese number of name plate attaching drawing is SMC number."]
[null,null,null,"LIFTING POSITION","-","-","-","-","-","-","-","-","-","Z-129-ZZ",{"$f":"VLOOKUP(N443,'STICKER LIST'!$B$5:$F$33,2,FALSE)","v":"F41738"},{"$f":"VLOOKUP(N443,'STICKER LIST'!$B$5:$F$33,3,FALSE)","v":30384},{"$f":"VLOOKUP(N443,'STICKER LIST'!$B$5:$F$33,4,FALSE)","v":"←"},{"$f":"VLOOKUP(N443,'STICKER LIST'!$B$5:$F$33,5,FALSE)","v":"←"}]
[null,null,null,"COMPRESSED AIR SUPPLY","-","-","-","-","-","-","-","-","-","DELETE"]
[null,null,null,"MAGNETIC FIELD ATTENTION, NO APPROACH OF PACEMAKER WEARERS","-","-","-","-","-","-","-","-","-","Z-139-ZZ",{"$f":"VLOOKUP(N445,'STICKER LIST'!$B$5:$F$33,2,FALSE)","v":"F41739"},{"$f":"VLOOKUP(N445,'STICKER LIST'!$B$5:$F$33,3,FALSE)","v":30385},{"$f":"VLOOKUP(N445,'STICKER LIST'!$B$5:$F$33,4,FALSE)","v":"←"},{"$f":"VLOOKUP(N445,'STICKER LIST'!$B$5:$F$33,5,FALSE)","v":"←"},"The number used in the name plate attaching drawing is SMC number."]
[null,null,null,null,null,null,null,null,null,null,null,null,null,"Z-149-ZZ",{"$f":"VLOOKUP(N446,'STICKER LIST'!$B$5:$F$33,2,FALSE)","v":"F41740"},{"$f":"VLOOKUP(N446,'STICKER LIST'!$B$5:$F$33,3,FALSE)","v":30386},{"$f":"VLOOKUP(N446,'STICKER LIST'!$B$5:$F$33,4,FALSE)","v":"←"},{"$f":"VLOOKUP(N446,'STICKER LIST'!$B$5:$F$33,5,FALSE)","v":"←"}]
[null,null,null,"If breaker trips, turn breaker OFF, refer to instruction manual to solve problem, then restart operation","-","-","-","-","-","-","-","-","-","N-A02-□□",{"$f":"VLOOKUP(N447,'STICKER LIST'!$B$5:$F$33,2,FALSE)","v":"F39263"},{"$f":"VLOOKUP(N447,'STICKER LIST'!$B$5:$F$33,3,FALSE)","v":29809},{"$f":"VLOOKUP(N447,'STICKER LIST'!$B$5:$F$33,4,FALSE)","v":29810},{"$f":"VLOOKUP(N447,'STICKER LIST'!$B$5:$F$33,5,FALSE)","v":29812},"The number used in the name plate attaching drawing is SMC number."]
[]
[]
["【SMGL】"]
[]
["MODEL","NAME PLATE ATTACHING DRAWING",null,"CONVENTIONAL",null,null,null,null,null,null,null,null,null,"NEW",null,null,null,null,"REFERENCE"]
["100（Japanese）",180586,null,null,"Japanese",null,null,"English",null,null,"Chinese",null,null,null,null,"CORD(MJ)"]
["100OP（Japanese）",149767,null,"NAME","NUMBER","DRAWING NUMBER(MJ)","CORD(MJ)","NUMBER","DRAWING NUMBER(MJ)","CORD(MJ)","NUMBER","DRAWING NUMBER(MJ)","CORD(MJ)","NUMBER","DRAWING NUMBER(MJ)","Japanese","English","Chinese"]
["100（English）","A03882",null,"ELECTRIC SHOCK HAZARD","5-18-1","736902/1",22128,"5-68","738372/1",14611,"5-118","748599/1",15083,"Z-019-ZZ",{"$f":"VLOOKUP(N455,'STICKER LIST'!$B$5:$F$33,2,FALSE)","v":"F39248"},{"$f":"VLOOKUP(N455,'STICKER LIST'!$B$5:$F$33,3,FALSE)","v":29767},{"$f":"VLOOKUP(N455,'STICKER LIST'!$B$5:$F$33,4,FALSE)","v":"←"},{"$f":"VLOOKUP(N455,'STICKER LIST'!$B$5:$F$33,5,FALSE)","v":"←"}]
["100OP（English）",171436,null,"ROTATING PARTS","4-11",149478,18888,"4-61",149814,19534,"4-111",177974,"-","W-031-□□",{"$f":"VLOOKUP(N456,'STICKER LIST'!$B$5:$F$33,2,FALSE)","v":"F39250"},{"$f":"VLOOKUP(N456,'STICKER LIST'!$B$5:$F$33,3,FALSE)","v":29772},{"$f":"VLOOKUP(N456,'STICKER LIST'!$B$5:$F$33,4,FALSE)","v":29773},{"$f":"VLOOKUP(N456,'STICKER LIST'!$B$5:$F$33,5,FALSE)","v":29774}]
["200（Japanese）","A10790",null,"ROTATING PARTS","4-12",149479,18889,"4-62",149815,19537,"4-112",177975,"-","W-031-□□",{"$f":"VLOOKUP(N457,'STICKER LIST'!$B$5:$F$33,2,FALSE)","v":"F39250"},{"$f":"VLOOKUP(N457,'STICKER LIST'!$B$5:$F$33,3,FALSE)","v":29772},{"$f":"VLOOKUP(N457,'STICKER LIST'!$B$5:$F$33,4,FALSE)","v":29773},{"$f":"VLOOKUP(N457,'STICKER LIST'!$B$5:$F$33,5,FALSE)","v":29774}]
["200OP（Japanese）",149768,null,"ROTATING PARTS","5-22-1","731302/1",14580,"5-72","737036/1",14602,"5-122","748588/1",15085,"W-031-□□",{"$f":"VLOOKUP(N458,'STICKER LIST'!$B$5:$F$33,2,FALSE)","v":"F39250"},{"$f":"VLOOKUP(N458,'STICKER LIST'!$B$5:$F$33,3,FALSE)","v":29772},{"$f":"VLOOKUP(N458,'STICKER LIST'!$B$5:$F$33,4,FALSE)","v":29773},{"$f":"VLOOKUP(N458,'STICKER LIST'!$B$5:$F$33,5,FALSE)","v":29774},"Used for 300"]
["200（English）","A10870",null,"PINCH POINT","5-45",149481,18891,"5-95",149818,19530,"5-145",177979,"-","W-051-□□",{"$f":"VLOOKUP(N459,'STICKER LIST'!$B$5:$F$33,2,FALSE)","v":"F39254"},{"$f":"VLOOKUP(N459,'STICKER LIST'!$B$5:$F$33,3,FALSE)","v":29782},{"$f":"VLOOKUP(N459,'STICKER LIST'!$B$5:$F$33,4,FALSE)","v":29783},{"$f":"VLOOKUP(N459,'STICKER LIST'!$B$5:$F$33,5,FALSE)","v":29784}]
["200OP（English）",171437,null,"PINCH POINT","5-46",149482,18892,"5-96",149819,19528,"5-146",177981,"-","W-051-□□",{"$f":"VLOOKUP(N460,'STICKER LIST'!$B$5:$F$33,2,FALSE)","v":"F39254"},{"$f":"VLOOKUP(N460,'STICKER LIST'!$B$5:$F$33,3,FALSE)","v":29782},{"$f":"VLOOKUP(N460,'STICKER LIST'!$B$5:$F$33,4,FALSE)","v":29783},{"$f":"VLOOKUP(N460,'STICKER LIST'!$B$5:$F$33,5,FALSE)","v":29784}]
["300（Japanese）",149769,null,"TOPPLING HAZARD","4-10",149477,18887,"4-60",149813,19536,"4-110",177973,"-","D-072-□□",{"$f":"VLOOKUP(N461,'STICKER LIST'!$B$5:$F$33,2,FALSE)","v":"F39258"},{"$f":"VLOOKUP(N461,'STICKER LIST'!$B$5:$F$33,3,FALSE)","v":29794},{"$f":"VLOOKUP(N461,'STICKER LIST'!$B$5:$F$33,4,FALSE)","v":29795},{"$f":"VLOOKUP(N461,'STICKER LIST'!$B$5:$F$33,5,FALSE)","v":29796}]
["300OP（Japanese）",167548,null,"TOPPLING HAZARD","5-44",149480,18890,"5-94",149816,19535,"5-144",177977,19535,"D-072-□□",{"$f":"VLOOKUP(N462,'STICKER LIST'!$B$5:$F$33,2,FALSE)","v":"F39258"},{"$f":"VLOOKUP(N462,'STICKER LIST'!$B$5:$F$33,3,FALSE)","v":29794},{"$f":"VLOOKUP(N462,'STICKER LIST'!$B$5:$F$33,4,FALSE)","v":29795},{"$f":"VLOOKUP(N462,'STICKER LIST'!$B$5:$F$33,5,FALSE)","v":29796}]
["300（English）",171438,null,"SHARP POINTS","5-47",149483,18893,"5-97",149820,19531,"5-147",177982,"-","Z-089-ZZ",{"$f":"VLOOKUP(N463,'STICKER LIST'!$B$5:$F$33,2,FALSE)","v":"F39259"},{"$f":"VLOOKUP(N463,'STICKER LIST'!$B$5:$F$33,3,FALSE)","v":29797},{"$f":"VLOOKUP(N463,'STICKER LIST'!$B$5:$F$33,4,FALSE)","v":"←"},{"$f":"VLOOKUP(N463,'STICKER LIST'!$B$5:$F$33,5,FALSE)","v":"←"}]
["300OP（English）","A03883",null,"FLYING DEBRIS","4-13",149594,18898,"4-63",149828,19538,"4-113",177976,"-","W-091-□□",{"$f":"VLOOKUP(N464,'STICKER LIST'!$B$5:$F$33,2,FALSE)","v":"F39260"},{"$f":"VLOOKUP(N464,'STICKER LIST'!$B$5:$F$33,3,FALSE)","v":29798},{"$f":"VLOOKUP(N464,'STICKER LIST'!$B$5:$F$33,4,FALSE)","v":29799},{"$f":"VLOOKUP(N464,'STICKER LIST'!$B$5:$F$33,5,FALSE)","v":29800}]
[null,null,null,"HANDLING PRECAUTIONS","5-49","149574/2",18897,"5-99-1","149827/1",17539,"5-149",177984,"-","DELETE",null,null,null,null,"Write details in the instruction manual."]
[null,null,null,"CAUTION","6-26","149485/2",18895,"6-76",149824,19533,"6-126",177985,"-","DELETE",null,null,null,null,"Write details in the instruction manual."]
[null,null,null,"HANDLING PRECAUTIONS","7-9","149486/1",18896,"7-59-1","149825/1",19529,"7-109",177986,"-","DELETE",null,null,null,null,"Write details in the instruction manual."]
[null,null,null,"CAUTION FOR MALFUNCTION","5-48",149484,18894,"5-98",149823,19532,"5-148",177983,"-","N-A01-□□",{"$f":"VLOOKUP(N468,'STICKER LIST'!$B$5:$F$33,2,FALSE)","v":"F39240"},{"$f":"VLOOKUP(N468,'STICKER LIST'!$B$5:$F$33,3,FALSE)","v":29745},{"$f":"VLOOKUP(N468,'STICKER LIST'!$B$5:$F$33,4,FALSE)","v":29807},{"$f":"VLOOKUP(N468,'STICKER LIST'!$B$5:$F$33,5,FALSE)","v":29808}]
[]
[]
["【MGL2】"]
[]
["MODEL","NAME PLATE ATTACHING DRAWING",null,"CONVENTIONAL",null,null,null,null,null,null,null,null,null,"NEW",null,null,null,null,"REFERENCE"]
["５0（Japanese）","A68318",null,null,"Japanese",null,null,"English",null,null,"Chinese",null,null,null,null,"CORD(MJ)"]
["５0（English）","A68319",null,"NAME","NUMBER","DRAWING NUMBER(MJ)","CORD(MJ)","NUMBER","DRAWING NUMBER(MJ)","CORD(MJ)","NUMBER","DRAWING NUMBER(MJ)","CORD(MJ)","NUMBER","DRAWING NUMBER(MJ)","Japanese","English","Chinese"]
["100（Japanese）","A67412",null,"ELECTRIC SHOCK HAZARD","5-18-1","736902/1",22128,"5-68","738372/1",14611,"5-118","748599/1",15083,"Z-019-ZZ",{"$f":"VLOOKUP(N476,'STICKER LIST'!$B$5:$F$33,2,FALSE)","v":"F39248"},{"$f":"VLOOKUP(N476,'STICKER LIST'!$B$5:$F$33,3,FALSE)","v":29767},{"$f":"VLOOKUP(N476,'STICKER LIST'!$B$5:$F$33,4,FALSE)","v":"←"},{"$f":"VLOOKUP(N476,'STICKER LIST'!$B$5:$F$33,5,FALSE)","v":"←"}]
["100（English）","A67413",null,"ROTATING PARTS","4-11",149478,18888,"4-61",149814,19534,"4-111",177974,"-","W-031-□□",{"$f":"VLOOKUP(N477,'STICKER LIST'!$B$5:$F$33,2,FALSE)","v":"F39250"},{"$f":"VLOOKUP(N477,'STICKER LIST'!$B$5:$F$33,3,FALSE)","v":29772},{"$f":"VLOOKUP(N477,'STICKER LIST'!$B$5:$F$33,4,FALSE)","v":29773},{"$f":"VLOOKUP(N477,'STICKER LIST'!$B$5:$F$33,5,FALSE)","v":29774}]
["200（Japanese）","A65445",null,"ROTATING PARTS","4-12",149479,18889,"4-62",149815,19537,"4-112",177975,"-","W-031-□□",{"$f":"VLOOKUP(N478,'STICKER LIST'!$B$5:$F$33,2,FALSE)","v":"F39250"},{"$f":"VLOOKUP(N478,'STICKER LIST'!$B$5:$F$33,3,FALSE)","v":29772},{"$f":"VLOOKUP(N478,'STICKER LIST'!$B$5:$F$33,4,FALSE)","v":29773},{"$f":"VLOOKUP(N478,'STICKER LIST'!$B$5:$F$33,5,FALSE)","v":29774}]
["200（English）","A65446",null,"ROTATING PARTS","5-22-1","731302/1",14580,"5-72","737036/1",14602,"5-122","748588/1",15085,"W-031-□□",{"$f":"VLOOKUP(N479,'STICKER LIST'!$B$5:$F$33,2,FALSE)","v":"F39250"},{"$f":"VLOOKUP(N479,'STICKER LIST'!$B$5:$F$33,3,FALSE)","v":29772},{"$f":"VLOOKUP(N479,'STICKER LIST'!$B$5:$F$33,4,FALSE)","v":29773},{"$f":"VLOOKUP(N479,'STICKER LIST'!$B$5:$F$33,5,FALSE)","v":29774},"Used for 300"]
["300（Japanese）","B29676",null,"PINCH POINT","5-45",149481,18891,"5-95",149818,19530,"5-145",177979,"-","W-051-□□",{"$f":"VLOOKUP(N480,'STICKER LIST'!$B$5:$F$33,2,FALSE)","v":"F39254"},{"$f":"VLOOKUP(N480,'STICKER LIST'!$B$5:$F$33,3,FALSE)","v":29782},{"$f":"VLOOKUP(N480,'STICKER LIST'!$B$5:$F$33,4,FALSE)","v":29783},{"$f":"VLOOKUP(N480,'STICKER LIST'!$B$5:$F$33,5,FALSE)","v":29784}]
["300（English）","B29677",null,"PINCH POINT","5-46",149482,18892,"5-96",149819,19528,"5-146",177981,"-","W-051-□□",{"$f":"VLOOKUP(N481,'STICKER LIST'!$B$5:$F$33,2,FALSE)","v":"F39254"},{"$f":"VLOOKUP(N481,'STICKER LIST'!$B$5:$F$33,3,FALSE)","v":29782},{"$f":"VLOOKUP(N481,'STICKER LIST'!$B$5:$F$33,4,FALSE)","v":29783},{"$f":"VLOOKUP(N481,'STICKER LIST'!$B$5:$F$33,5,FALSE)","v":29784}]
[null,null,null,"PINCH POINT","5-54","A15355",22235,"5-104","A25895","-","-","-","-","W-051-□□",{"$f":"VLOOKUP(N482,'STICKER LIST'!$B$5:$F$33,2,FALSE)","v":"F39254"},{"$f":"VLOOKUP(N482,'STICKER LIST'!$B$5:$F$33,3,FALSE)","v":29782},{"$f":"VLOOKUP(N482,'STICKER LIST'!$B$5:$F$33,4,FALSE)","v":29783},{"$f":"VLOOKUP(N482,'STICKER LIST'!$B$5:$F$33,5,FALSE)","v":29784}]
[null,null,null,"SHARP POINTS","5-47",149483,18893,"5-97",149820,19531,"5-147",177982,"-","Z-089-ZZ",{"$f":"VLOOKUP(N483,'STICKER LIST'!$B$5:$F$33,2,FALSE)","v":"F39259"},{"$f":"VLOOKUP(N483,'STICKER LIST'!$B$5:$F$33,3,FALSE)","v":29797},{"$f":"VLOOKUP(N483,'STICKER LIST'!$B$5:$F$33,4,FALSE)","v":"←"},{"$f":"VLOOKUP(N483,'STICKER LIST'!$B$5:$F$33,5,FALSE)","v":"←"}]
[null,null,null,"FLYING DEBRIS","4-13",149594,18898,"4-63",149828,19538,"4-113",177976,"-","W-091-□□",{"$f":"VLOOKUP(N484,'STICKER LIST'!$B$5:$F$33,2,FALSE)","v":"F39260"},{"$f":"VLOOKUP(N484,'STICKER LIST'!$B$5:$F$33,3,FALSE)","v":29798},{"$f":"VLOOKUP(N484,'STICKER LIST'!$B$5:$F$33,4,FALSE)","v":29799},{"$f":"VLOOKUP(N484,'STICKER LIST'!$B$5:$F$33,5,FALSE)","v":29800}]
[null,null,null,"HANDLING PRECAUTIONS","5-49","149574/2",18897,"5-99-1","149827/1",17539,"5-149",177984,"-","DELETE",null,null,null,null,"Write details in the instruction manual."]
[null,null,null,"DO NOT REMOVE THE LIMIT SWITCH","5-50",185700,21904,"5-100","186575/1","-","-","-","-","DELETE",null,null,null,null,"Write details in the instruction manual."]
[null,null,null,"CAUTION","6-26","149485/2",18895,"6-76",149824,19533,"6-126",177985,"-","DELETE",null,null,null,null,"Write details in the instruction manual."]
[null,null,null,"HANDLING PRECAUTIONS","7-9","149486/1",18896,"7-59-1","149825/1",19529,"7-109",177986,"-","DELETE",null,null,null,null,"Write details in the instruction manual."]
[null,null,null,"CAUTION FOR MALFUNCTION","5-48",149484,18894,"5-98",149823,19532,"5-148",177983,"-","N-A01-□□",{"$f":"VLOOKUP(N489,'STICKER LIST'!$B$5:$F$33,2,FALSE)","v":"F39240"},{"$f":"VLOOKUP(N489,'STICKER LIST'!$B$5:$F$33,3,FALSE)","v":29745},{"$f":"VLOOKUP(N489,'STICKER LIST'!$B$5:$F$33,4,FALSE)","v":29807},{"$f":"VLOOKUP(N489,'STICKER LIST'!$B$5:$F$33,5,FALSE)","v":29808}]
[]
[]
["【MSHT-i-800】"]
[]
["MODEL","NAME PLATE ATTACHING DRAWING",null,"CONVENTIONAL",null,null,null,null,null,null,null,null,null,"NEW",null,null,null,null,"REFERENCE"]
["Japanese","B40005",null,null,"Japanese",null,null,"English",null,null,"Chinese",null,null,null,null,"CORD(MJ)"]
["English","B41186",null,"NAME","NUMBER","DRAWING NUMBER(MJ)","CORD(MJ)","NUMBER","DRAWING NUMBER(MJ)","CORD(MJ)","NUMBER","DRAWING NUMBER(MJ)","CORD(MJ)","NUMBER","DRAWING NUMBER(MJ)","Japanese","English","Chinese"]
[null,null,null,"ELECTRIC SHOCK HAZARD","5-18-1","736902/1",22128,"5-68","738372/1",14611,"5-118","748599/1",15083,"Z-019-ZZ",{"$f":"VLOOKUP(N497,'STICKER LIST'!$B$5:$F$33,2,FALSE)","v":"F39248"},{"$f":"VLOOKUP(N497,'STICKER LIST'!$B$5:$F$33,3,FALSE)","v":29767},{"$f":"VLOOKUP(N497,'STICKER LIST'!$B$5:$F$33,4,FALSE)","v":"←"},{"$f":"VLOOKUP(N497,'STICKER LIST'!$B$5:$F$33,5,FALSE)","v":"←"}]
[null,null,null,"ELECTRIC SHOCK HAZARD","-","-","-","-","-","-","-","-","-","Z-019-ZZ",{"$f":"VLOOKUP(N498,'STICKER LIST'!$B$5:$F$33,2,FALSE)","v":"F39248"},{"$f":"VLOOKUP(N498,'STICKER LIST'!$B$5:$F$33,3,FALSE)","v":29767},{"$f":"VLOOKUP(N498,'STICKER LIST'!$B$5:$F$33,4,FALSE)","v":"←"},{"$f":"VLOOKUP(N498,'STICKER LIST'!$B$5:$F$33,5,FALSE)","v":"←"},"Used for TB(new)"]
[null,null,null,"ROTATING PARTS","4-11",149478,18888,"4-61",149814,19534,"4-111",177974,"-","D-032-□□",{"$f":"VLOOKUP(N499,'STICKER LIST'!$B$5:$F$33,2,FALSE)","v":"F39251"},{"$f":"VLOOKUP(N499,'STICKER LIST'!$B$5:$F$33,3,FALSE)","v":29775},{"$f":"VLOOKUP(N499,'STICKER LIST'!$B$5:$F$33,4,FALSE)","v":29776},{"$f":"VLOOKUP(N499,'STICKER LIST'!$B$5:$F$33,5,FALSE)","v":29777}]
[null,null,null,"ROTATING PARTS","4-12",149479,18889,"4-62",149815,19537,"4-112",177975,"-","D-032-□□",{"$f":"VLOOKUP(N500,'STICKER LIST'!$B$5:$F$33,2,FALSE)","v":"F39251"},{"$f":"VLOOKUP(N500,'STICKER LIST'!$B$5:$F$33,3,FALSE)","v":29775},{"$f":"VLOOKUP(N500,'STICKER LIST'!$B$5:$F$33,4,FALSE)","v":29776},{"$f":"VLOOKUP(N500,'STICKER LIST'!$B$5:$F$33,5,FALSE)","v":29777}]
[null,null,null,"ENTANGLEMENT HAZARD","5-20-1","731294/1",14579,"5-70","737035/1",14601,"5-120","748587/1","-","W-061-□□",{"$f":"VLOOKUP(N501,'STICKER LIST'!$B$5:$F$33,2,FALSE)","v":"F39256"},{"$f":"VLOOKUP(N501,'STICKER LIST'!$B$5:$F$33,3,FALSE)","v":29788},{"$f":"VLOOKUP(N501,'STICKER LIST'!$B$5:$F$33,4,FALSE)","v":29789},{"$f":"VLOOKUP(N501,'STICKER LIST'!$B$5:$F$33,5,FALSE)","v":29790}]
[null,null,null,"FLYING DEBRIS","4-13",149594,18898,"4-63",149828,19538,"4-113",177976,"-","W-091-□□",{"$f":"VLOOKUP(N502,'STICKER LIST'!$B$5:$F$33,2,FALSE)","v":"F39260"},{"$f":"VLOOKUP(N502,'STICKER LIST'!$B$5:$F$33,3,FALSE)","v":29798},{"$f":"VLOOKUP(N502,'STICKER LIST'!$B$5:$F$33,4,FALSE)","v":29799},{"$f":"VLOOKUP(N502,'STICKER LIST'!$B$5:$F$33,5,FALSE)","v":29800}]
[null,null,null,"CAUTION FOR MALFUNCTION","5-48",149484,18894,"5-98",149823,19532,"5-148",177983,"-","N-A01-□□",{"$f":"VLOOKUP(N503,'STICKER LIST'!$B$5:$F$33,2,FALSE)","v":"F39240"},{"$f":"VLOOKUP(N503,'STICKER LIST'!$B$5:$F$33,3,FALSE)","v":29745},{"$f":"VLOOKUP(N503,'STICKER LIST'!$B$5:$F$33,4,FALSE)","v":29807},{"$f":"VLOOKUP(N503,'STICKER LIST'!$B$5:$F$33,5,FALSE)","v":29808}]
[null,null,null,"CAUTION","5-56","A62666/1","-","5-106","A69472","-","-","-","-","DELETE",null,null,null,null,"Write details in the instruction manual."]
[]
[]
["【MSHT-i-600】"]
[]
["MODEL","NAME PLATE ATTACHING DRAWING",null,"CONVENTIONAL",null,null,null,null,null,null,null,null,null,"NEW",null,null,null,null,"REFERENCE"]
["Japanese","A62668",null,null,"Japanese",null,null,"English",null,null,"Chinese",null,null,null,null,"CORD(MJ)"]
["English","B76783",null,"NAME","NUMBER","DRAWING NUMBER(MJ)","CORD(MJ)","NUMBER","DRAWING NUMBER(MJ)","CORD(MJ)","NUMBER","DRAWING NUMBER(MJ)","CORD(MJ)","NUMBER","DRAWING NUMBER(MJ)","Japanese","English","Chinese"]
[null,null,null,"ELECTRIC SHOCK HAZARD","5-18-1","736902/1",22128,"5-68","738372/1",14611,"5-118","748599/1",15083,"Z-019-ZZ",{"$f":"VLOOKUP(N512,'STICKER LIST'!$B$5:$F$33,2,FALSE)","v":"F39248"},{"$f":"VLOOKUP(N512,'STICKER LIST'!$B$5:$F$33,3,FALSE)","v":29767},{"$f":"VLOOKUP(N512,'STICKER LIST'!$B$5:$F$33,4,FALSE)","v":"←"},{"$f":"VLOOKUP(N512,'STICKER LIST'!$B$5:$F$33,5,FALSE)","v":"←"}]
[null,null,null,"ELECTRIC SHOCK HAZARD","-","-","-","-","-","-","-","-","-","Z-019-ZZ",{"$f":"VLOOKUP(N513,'STICKER LIST'!$B$5:$F$33,2,FALSE)","v":"F39248"},{"$f":"VLOOKUP(N513,'STICKER LIST'!$B$5:$F$33,3,FALSE)","v":29767},{"$f":"VLOOKUP(N513,'STICKER LIST'!$B$5:$F$33,4,FALSE)","v":"←"},{"$f":"VLOOKUP(N513,'STICKER LIST'!$B$5:$F$33,5,FALSE)","v":"←"},"Used for TB(new)"]
[null,null,null,"ROTATING PARTS","4-11",149478,18888,"4-61",149814,19534,"4-111",177974,"-","D-032-□□",{"$f":"VLOOKUP(N514,'STICKER LIST'!$B$5:$F$33,2,FALSE)","v":"F39251"},{"$f":"VLOOKUP(N514,'STICKER LIST'!$B$5:$F$33,3,FALSE)","v":29775},{"$f":"VLOOKUP(N514,'STICKER LIST'!$B$5:$F$33,4,FALSE)","v":29776},{"$f":"VLOOKUP(N514,'STICKER LIST'!$B$5:$F$33,5,FALSE)","v":29777}]
[null,null,null,"ROTATING PARTS","4-12",149479,18889,"4-62",149815,19537,"4-112",177975,"-","D-032-□□",{"$f":"VLOOKUP(N515,'STICKER LIST'!$B$5:$F$33,2,FALSE)","v":"F39251"},{"$f":"VLOOKUP(N515,'STICKER LIST'!$B$5:$F$33,3,FALSE)","v":29775},{"$f":"VLOOKUP(N515,'STICKER LIST'!$B$5:$F$33,4,FALSE)","v":29776},{"$f":"VLOOKUP(N515,'STICKER LIST'!$B$5:$F$33,5,FALSE)","v":29777}]
[null,null,null,"ENTANGLEMENT HAZARD","5-12",740009,14595,"5-62","A69471","-","5-112","748597/1",15080,"W-061-□□",{"$f":"VLOOKUP(N516,'STICKER LIST'!$B$5:$F$33,2,FALSE)","v":"F39256"},{"$f":"VLOOKUP(N516,'STICKER LIST'!$B$5:$F$33,3,FALSE)","v":29788},{"$f":"VLOOKUP(N516,'STICKER LIST'!$B$5:$F$33,4,FALSE)","v":29789},{"$f":"VLOOKUP(N516,'STICKER LIST'!$B$5:$F$33,5,FALSE)","v":29790}]
[null,null,null,"ENTANGLEMENT HAZARD","5-20-1","731294/1",14579,"5-70","737035/1",14601,"5-120","748587/1","-","W-061-□□",{"$f":"VLOOKUP(N517,'STICKER LIST'!$B$5:$F$33,2,FALSE)","v":"F39256"},{"$f":"VLOOKUP(N517,'STICKER LIST'!$B$5:$F$33,3,FALSE)","v":29788},{"$f":"VLOOKUP(N517,'STICKER LIST'!$B$5:$F$33,4,FALSE)","v":29789},{"$f":"VLOOKUP(N517,'STICKER LIST'!$B$5:$F$33,5,FALSE)","v":29790}]
[null,null,null,"FLYING DEBRIS","4-13",149594,18898,"4-63",149828,19538,"4-113",177976,"-","W-091-□□",{"$f":"VLOOKUP(N518,'STICKER LIST'!$B$5:$F$33,2,FALSE)","v":"F39260"},{"$f":"VLOOKUP(N518,'STICKER LIST'!$B$5:$F$33,3,FALSE)","v":29798},{"$f":"VLOOKUP(N518,'STICKER LIST'!$B$5:$F$33,4,FALSE)","v":29799},{"$f":"VLOOKUP(N518,'STICKER LIST'!$B$5:$F$33,5,FALSE)","v":29800}]
[null,null,null,"CAUTION FOR MALFUNCTION","5-48",149484,18894,"5-98",149823,19532,"5-148",177983,"-","N-A01-□□",{"$f":"VLOOKUP(N519,'STICKER LIST'!$B$5:$F$33,2,FALSE)","v":"F39240"},{"$f":"VLOOKUP(N519,'STICKER LIST'!$B$5:$F$33,3,FALSE)","v":29745},{"$f":"VLOOKUP(N519,'STICKER LIST'!$B$5:$F$33,4,FALSE)","v":29807},{"$f":"VLOOKUP(N519,'STICKER LIST'!$B$5:$F$33,5,FALSE)","v":29808}]
[null,null,null,"CAUTION","6-26","149485/2",18895,"6-76",149824,19533,"6-126",177985,"-","DELETE",null,null,null,null,"Write details in the instruction manual."]
[null,null,null,"CAUTION","5-56","A62666/1","-","5-106","A69472","-","-","-","-","DELETE",null,null,null,null,"Write details in the instruction manual."]
[]
[]
["【PD】"]
[]
["MODEL","NAME PLATE ATTACHING DRAWING",null,"CONVENTIONAL",null,null,null,null,null,null,null,null,null,"NEW",null,null,null,null,"REFERENCE"]
["-","A11011",null,null,"Japanese",null,null,"English",null,null,"Chinese",null,null,null,null,"CORD(MJ)"]
[null,null,null,"NAME","NUMBER","DRAWING NUMBER(MJ)","CORD(MJ)","NUMBER","DRAWING NUMBER(MJ)","CORD(MJ)","NUMBER","DRAWING NUMBER(MJ)","CORD(MJ)","NUMBER","DRAWING NUMBER(MJ)","Japanese","English","Chinese"]
[null,null,null,"MOVING PARTS","5-51","191271/1",21513,"5-101","191310/1",23331,"5-151",191311,26573,"Z-049-ZZ",{"$f":"VLOOKUP(N529,'STICKER LIST'!$B$5:$F$33,2,FALSE)","v":"F41737"},{"$f":"VLOOKUP(N529,'STICKER LIST'!$B$5:$F$33,3,FALSE)","v":30383},{"$f":"VLOOKUP(N529,'STICKER LIST'!$B$5:$F$33,4,FALSE)","v":"←"},{"$f":"VLOOKUP(N529,'STICKER LIST'!$B$5:$F$33,5,FALSE)","v":"←"}]
[]
[]
[]
["【Rotary valve(Lid for weighing check)】"]
[]
["MODEL","NAME PLATE ATTACHING DRAWING",null,"CONVENTIONAL",null,null,null,null,null,null,null,null,null,"NEW",null,null,null,null,"REFERENCE"]
["-","S33107",null,null,"Japanese",null,null,"English",null,null,"Chinese",null,null,null,null,"CORD(MJ)"]
["-","S33007",null,"NAME","NUMBER","DRAWING NUMBER(MJ)","CORD(MJ)","NUMBER","DRAWING NUMBER(MJ)","CORD(MJ)","NUMBER","DRAWING NUMBER(MJ)","CORD(MJ)","NUMBER","DRAWING NUMBER(MJ)","Japanese","English","Chinese"]
[null,null,null,"ROTATING PARTS","5-36-1","736269/1",14585,"5-86","737040/1",14606,"5-136","748592/1",15090,"Z-039-ZZ",{"$f":"VLOOKUP(N538,'STICKER LIST'!$B$5:$F$33,2,FALSE)","v":"F39252"},{"$f":"VLOOKUP(N538,'STICKER LIST'!$B$5:$F$33,3,FALSE)","v":29778},{"$f":"VLOOKUP(N538,'STICKER LIST'!$B$5:$F$33,4,FALSE)","v":"←"},{"$f":"VLOOKUP(N538,'STICKER LIST'!$B$5:$F$33,5,FALSE)","v":"←"}]
[]
[]
["【Slide gate】"]
[]
["MODEL","NAME PLATE ATTACHING DRAWING",null,"CONVENTIONAL",null,null,null,null,null,null,null,null,null,"NEW",null,null,null,null,"REFERENCE"]
["-","-",null,null,"Japanese",null,null,"English",null,null,"Chinese",null,null,null,null,"CORD(MJ)"]
[null,null,null,"NAME","NUMBER","DRAWING NUMBER(MJ)","CORD(MJ)","NUMBER","DRAWING NUMBER(MJ)","CORD(MJ)","NUMBER","DRAWING NUMBER(MJ)","CORD(MJ)","NUMBER","DRAWING NUMBER(MJ)","Japanese","English","Chinese"]
[null,null,null,"MOVING PARTS","6-21-1","731303/2",14587,"6-71","737042/2",14608,"6-121","748594/1",15093,"W-041-□□",{"$f":"VLOOKUP(N546,'STICKER LIST'!$B$5:$F$33,2,FALSE)","v":"F39253"},{"$f":"VLOOKUP(N546,'STICKER LIST'!$B$5:$F$33,3,FALSE)","v":29779},{"$f":"VLOOKUP(N546,'STICKER LIST'!$B$5:$F$33,4,FALSE)","v":29780},{"$f":"VLOOKUP(N546,'STICKER LIST'!$B$5:$F$33,5,FALSE)","v":29781}]

{"sheet":"NOTES","index":5,"n_rows":68,"n_cols":16,"rows_kept":68,"cut":false,"hidden":false,"merged":[]}
["NOTES"]
[]
["1.  The position of the PL sticker is shown on the nameplate attaching drawing (common drawing of mechanical and electrical)."]
["　 If you can not draw common nameplate attaching drawing of mechanical and electrical, you draw it separately."]
["2.  You delete PL sticker written in existing drawing other than nameplate attaching drawing and revise parts list.\n"]
["     However if drawing have only symbol of \"ELECTRIC SHOCK HAZARD\" and no drawing number or sticker number, you need not revise it."]
[]
[]
[null,"Example:HD2 drawing(you need revise)",null,null,null,null,null,null,null,"Example:DMZ2 control panel drawing(you need revise)",null,null,null,null,"Example:MGD control panel drawing(you don't need revise)"]
[]
[]
[]
[]
[]
[]
[]
[]
[]
[]
[]
[]
[]
[]
[]
[]
[]
[]
[]
["3.   Use the form below (example: MJ5-i) for the parts list of the nameplate attaching drawing."]
["　  You write sticker number and drawing number referring to the example below."]
["     However, if the existing nameplate attaching drawing has a different form, refer to item 4 and revise it."]
[]
[null,"Example:MJ5-i"]
[null,null,null,null,null,null,null,null,null,"JAPANESE",null,"ENGLISH",null,"CHINESE"]
[null,null,null,null,null,null,null,null,null,"REGISTRATION NO.","DWG NO.","REGISTRATION NO.","DWG NO.","REGISTRATION NO.","DWG NO."]
[null,null,null,null,null,null,null,null,null,"W-021-JA","F39192","W-021-EN","F39192","W-021-ZH","F39192","⇐ With message"]
[null,null,null,null,null,null,null,null,null,"Z-029-ZZ","F39249","←",null,null,null,"⇐ Without message(Only symbol mark)"]
[]
[]
[]
[]
[]
[]
[]
[]
["4.  If the existing nameplate attaching drawing is not use the form above (item 3), please write the sticker number and note by referring to the example below."]
["　 The position of the note does not matter."]
[]
[null,"Example:HD2"]
[null,null,null,null,null,null,null,null,null,"REFERENCE"]
[null,null,null,null,null,null,null,null,null,"W-021-□□","⇐ With message"]
[null,null,null,null,null,null,null,null,null,"Z-029-ZZ","⇐ Without message(Only symbol mark)"]
[]
[null,null,null,null,null,null,null,null,null,"NOTE:In place of the square is the language code."]
[]
[]
[]
[]
[]
[]
["5.  After revising the drawing, please update revision number. (you don't have to get new drawing number)"]
["     You write the following in the revision column (CONTENTS)."]
[]
["　  CORRECTION BY UPDATING PL STICKER"]
[]
[]
["6.  If the existing instruction manual have the description of PL sticker, you need revise it."]
["     At this time, not only replace the image of the PL sticker, but also check the content of the instruction manual match the message on the PL sticker, and revise it as appropriate."]

{"sheet":"MODEL LIST","index":6,"n_rows":47,"n_cols":2,"rows_kept":47,"cut":false,"hidden":false,"merged":[]}
["MODEL LIST"]
[]
["MODEL","COMPANY"]
["HD2","SDI"]
["HD","SDI"]
["PMD","SDI"]
["MGD","SBC"]
["MJ3","SBC"]
["MJ5-i","SBC"]
["DMZ2","SBC"]
["NTD","SBC"]
["DMD4","SDI"]
["DPD3.1","SDI"]
["PO","SBC"]
["JL4","SBC"]
["PLP","SDI"]
["MC5-25/55/88","SBC"]
["MC-25/55/88","SDI"]
["MCHH-55/88","SDI"]
["MC5-55/88/100HH","SBC"]
["MC-5","SBC"]
["MCM","SDI"]
["MIC","SBC"]
["MC5-200/350/450","SBC"]
["MCLX/HX","SBC"]
["MCAX","SDI"]
["MCC5","SDI"]
["MCC5-i","SDI"]
["MCCA3","SDI"]
["RAD/M","SDI"]
["MCX","SBC"]
["T","SBC"]
["JCGB","SBC"]
["JC3","SDI"]
["JCLW","SDI"]
["JCW2-i","SDI"]
["JCW2","SDI"]
["JCT","SDI"]
["JSV","SBC"]
["SMGL3","SBC"]
["SMGL","SBC"]
["MGL2","SBC"]
["MSHT-i-800","SDI"]
["MSHT-i-600","SDI"]
["PD","SBC"]
["Rotary valve(Lid for weighing check)","SDI"]
["Slide gate","SDI"]